Ziza-6(13)-en-3-β-yl methyl ether

Normal alkane RI, non-polar column, custom temperature program

View large format table.

Column type Active phase I Reference Comment
CapillaryCP Sil 5 CB1640.Weyerstahl, Marschall, et al., 2000N2; Column length: 25. m; Phase thickness: 0.39 μm; Program: not specified

References

Weyerstahl, Marschall, et al., 2000
Weyerstahl, P.; Marschall, H.; Splittgerber, U. Wolf, Analysis of the polar fraction of Haitian vetiver oil, Flavour Fragr. J., 2000, 15, 3, 153-173, https://doi.org/10.1002/1099-1026(200005/06)15:3<153::AID-FFJ885>3.0.CO;2-5 . [all data]