Ethoxymethoxycyclododecane (Boisambrene)

Kovats' RI, non-polar column, isothermal

View large format table.

Column type Active phase Temperature (C) I Reference Comment
CapillaryOV-1150.1704.2Rudenko and Rudenko, 2000He; Column diameter: 0.25 mm
CapillaryOV-1170.1718.3Rudenko and Rudenko, 2000He; Column diameter: 0.25 mm
CapillaryOV-1190.1735.9Rudenko and Rudenko, 2000He; Column diameter: 0.25 mm

Kovats' RI, polar column, isothermal

View large format table.

Column type Active phase Temperature (C) I Reference Comment
CapillaryCarbowax 40M150.2001.5Rudenko and Rudenko, 2000He; Column diameter: 0.25 mm
CapillaryCarbowax 40M170.2022.1Rudenko and Rudenko, 2000He; Column diameter: 0.25 mm
CapillaryCarbowax 40M190.2061.1Rudenko and Rudenko, 2000He; Column diameter: 0.25 mm

References

Rudenko and Rudenko, 2000
Rudenko, B.A.; Rudenko, G.I., Capillary chromatography of cyclododecane derivatives, Proceedings, 23rd ISCC; CD-ROM, 2000, retrieved from http://www.richrom.com/assets/CD23PDF. [all data]