Propanoic acid, 2-chloro, nonyl ester

Kovats' RI, non-polar column, isothermal

View large format table.

Column type Active phase Temperature (C) I Reference Comment
CapillarySE-30120.1515.Haken and Korhonen, 1985Column length: 25. m; Column diameter: 0.33 mm
CapillarySE-30140.1521.Haken and Korhonen, 1985Column length: 25. m; Column diameter: 0.33 mm
CapillarySE-30160.1524.Haken and Korhonen, 1985Column length: 25. m; Column diameter: 0.33 mm
CapillarySE-30180.1525.Haken and Korhonen, 1985Column length: 25. m; Column diameter: 0.33 mm
CapillarySE-30200.1527.Haken and Korhonen, 1985Column length: 25. m; Column diameter: 0.33 mm
CapillarySE-30220.1520.Haken and Korhonen, 1985Column length: 25. m; Column diameter: 0.33 mm
CapillarySE-30240.1535.Haken and Korhonen, 1985Column length: 25. m; Column diameter: 0.33 mm
CapillarySE-30260.1552.Haken and Korhonen, 1985Column length: 25. m; Column diameter: 0.33 mm
CapillaryOV-101200.1534.Komárek, Hornová, et al., 1983Column length: 15. m; Column diameter: 0.22 mm

Kovats' RI, polar column, isothermal

View large format table.

Column type Active phase Temperature (C) I Reference Comment
CapillaryOV-351100.1885.Haken and Korhonen, 1985N2; Column length: 25. m; Column diameter: 0.32 mm
CapillaryOV-351120.1869.Haken and Korhonen, 1985N2; Column length: 25. m; Column diameter: 0.32 mm
CapillaryOV-351140.1913.Haken and Korhonen, 1985N2; Column length: 25. m; Column diameter: 0.32 mm
CapillaryOV-351160.1914.Haken and Korhonen, 1985N2; Column length: 25. m; Column diameter: 0.32 mm
CapillaryOV-351180.1922.Haken and Korhonen, 1985N2; Column length: 25. m; Column diameter: 0.32 mm
CapillaryOV-351200.1934.Haken and Korhonen, 1985N2; Column length: 25. m; Column diameter: 0.32 mm

References

Haken and Korhonen, 1985
Haken, J.K.; Korhonen, I.O.O., Gas chromatography of homologous esters. XXVII. Retention increments of C1-C18 primary alkanols and their 2-chloropropanoyl and 3-chloropropanoyl derivatives on SE-30 and OV-351 capillary columns, J. Chromatogr., 1985, 319, 131-142, https://doi.org/10.1016/S0021-9673(01)90548-5 . [all data]

Komárek, Hornová, et al., 1983
Komárek, K.; Hornová, L.; Horna, A.; Churácek, J., Glass capillary gas chromatography of homologous series of esters. III. Separation of alkyl halogenopropionates and halogenobutyrates on OV-101, J. Chromatogr., 1983, 262, 316-320, https://doi.org/10.1016/S0021-9673(01)88112-7 . [all data]