Myrcen-8-ol
- Formula: C10H16O
- Molecular weight: 152.2334
- IUPAC Standard InChIKey: IEVYLQISZQFFGA-JXMROGBWSA-N
- Chemical structure:
View 3d structure (requires JavaScript / HTML 5) - Species with the same structure:
- Stereoisomers:

Kovats' RI, non-polar column, temperature ramp

Column type | Active phase | I | Reference | Comment |
---|---|---|---|---|
Capillary | Methyl Silicone | 1103. | Adegoke, Rao, et al., 1998 | 30. m/0.32 mm/0.25 μm, He, 60. C @ 2. min, 2. K/min, 250. C @ 5. min |

References

Adegoke, Rao, et al., 1998
Adegoke, G.O.; Rao, L.J.M.; Shankaracharya, N.B.,
A comparison of the essential oils of Aframomum daniellii (Hook. f.) K. Schum. and Amomum subulatum Roxb,
Flavour Fragr. J., 1998, 13, 5, 349-352, https://doi.org/10.1002/(SICI)1099-1026(1998090)13:5<349::AID-FFJ758>3.0.CO;2-O
. [all data]