3α-hydroxy-9,15-cyclo-GA9 (GA107), MeTMS

Normal alkane RI, non-polar column, temperature ramp

View large format table.

Column type Active phase I Reference Comment
CapillaryDB-12545.Oyama, Yamauchi, et al., 1996160. C @ 2. min, 16. K/min; Column length: 15. m; Column diameter: 0.258 mm; Tend: 280. C
CapillaryDB-12550.Oyama, Yamauchi, et al., 1996160. C @ 2. min, 16. K/min; Column length: 15. m; Column diameter: 0.258 mm; Tend: 280. C

References

Oyama, Yamauchi, et al., 1996
Oyama, N.; Yamauchi, T.; Yamane, H.; Murofushi, N.; Agatsuma, M.; Pour, M.; Mander, L.N., Identification of gibberellins and 9,15-cyclogibberellins in developing apple seeds, Biosci. Biotechnol. Biochem., 1996, 60, 2, 305-308, https://doi.org/10.1271/bbb.60.305 . [all data]