4-O-acetyl-1,5-anhydro-2,3-di-O-methyl-D-fucitol

Van Den Dool and Kratz RI, non-polar column, temperature ramp

View large format table.

Column type Active phase I Reference Comment
CapillaryDB-51327.30Elvebak, Schmitt, et al., 199330. m/0.25 mm/0.25 μm, He, 2. K/min; Tstart: 80. C; Tend: 300. C

References

Elvebak, Schmitt, et al., 1993
Elvebak, L.E., II; Schmitt, T.; Gray, G.R., Authentic standards for the reductive-cleavage method. The positional isomers of partially methylated and acetylated or benzoylated 1,5-anhydro-D-fucitol, Carbohyd. Res., 1993, 246, 1, 1-11, https://doi.org/10.1016/0008-6215(93)84019-3 . [all data]