2-methyl-6-butylpyraine

Van Den Dool and Kratz RI, non-polar column, temperature ramp

View large format table.

Column type Active phase I Reference Comment
CapillaryDB-11120.Izzo and Ho, 199150. m/0.32 mm/1.05 μm, He, 2. K/min, 260. C @ 40. min; Tstart: 40. C

References

Izzo and Ho, 1991
Izzo, H.V.; Ho, C.-T., Isolation and identification of the volatile components of an extruded autolyzed yeast extract, J. Agric. Food Chem., 1991, 39, 12, 2245-2248, https://doi.org/10.1021/jf00012a029 . [all data]