Vinylacetyl glycine, mono-TMS

Van Den Dool and Kratz RI, non-polar column, temperature ramp

View large format table.

Column type Active phase I Reference Comment
PackedOV-11402.Ramsdell and Tanaka, 1980N2, Anakrom, 4. K/min; Column length: 2. m; Tstart: 80. C

References

Ramsdell and Tanaka, 1980
Ramsdell, H.S.; Tanaka, K., Gas chromatographic retention indices of twenty metabolically important acylglycines as trimethylsilyl derivatives, J. Chromatogr., 1980, 181, 1, 90-94, https://doi.org/10.1016/S0378-4347(00)81273-6 . [all data]