4,8-dibutyl-2-thiaadamantane

Kovats' RI, non-polar column, isothermal

View large format table.

Column type Active phase Temperature (C) I Reference Comment
CapillaryApiezon L190.2057.Janku and Popl, 1974N2; Column length: 50. m; Column diameter: 0.2 mm
CapillaryApiezon L200.2070.Janku and Popl, 1974N2; Column length: 50. m; Column diameter: 0.2 mm
CapillaryApiezon L210.2082.Janku and Popl, 1974N2; Column length: 50. m; Column diameter: 0.2 mm
CapillaryApiezon L190.2080.Janku and Popl, 1974N2; Column length: 50. m; Column diameter: 0.2 mm
CapillaryApiezon L200.2092.Janku and Popl, 1974N2; Column length: 50. m; Column diameter: 0.2 mm
CapillaryApiezon L210.2104.Janku and Popl, 1974N2; Column length: 50. m; Column diameter: 0.2 mm
CapillaryApiezon L190.2103.Janku and Popl, 1974N2; Column length: 50. m; Column diameter: 0.2 mm
CapillaryApiezon L200.2115.Janku and Popl, 1974N2; Column length: 50. m; Column diameter: 0.2 mm
CapillaryApiezon L210.2128.Janku and Popl, 1974N2; Column length: 50. m; Column diameter: 0.2 mm

References

Janku and Popl, 1974
Janku, J.; Popl, M., The gas chromatographic characterization of 2-thiaadamantane derivatives, J. Chromatogr., 1974, 89, 2, 319-324, https://doi.org/10.1016/S0021-9673(01)99406-3 . [all data]