Methyl 13β-Abieta-7,9(11)dien-18-oate
- Formula: C21H32O2
- Molecular weight: 316.4776
- IUPAC Standard InChIKey: HALJWOPQKXPVQL-HGWQEYRNSA-N
- Chemical structure:
View 3d structure (requires JavaScript / HTML 5) - Permanent link for this species. Use this link for bookmarking this species for future reference.

Van Den Dool and Kratz RI, non-polar column, temperature ramp

Column type | Active phase | I | Reference | Comment |
---|---|---|---|---|
Capillary | SE-30 | 2278. | Mayr, Lorbeer, et al., 1982 | 25. m/0.28 mm/0.15 μm, H2, 4. K/min; Tstart: 140. C; Tend: 280. C |

References

Mayr, Lorbeer, et al., 1982
Mayr, M.; Lorbeer, E.; Kratzl, K.,
Gas chromatographic separation of diterpene acids on glass capillary columns of different polarity,
J. Amer. Oil Chem. Soc., 1982, 59, 1, 52-57, https://doi.org/10.1007/BF02670069
. [all data]