N-Methyl-N-(2,4,5-trimethoxy-6-methoxymethyl-tetrahydro-pyran-3-yl)-acetamide

Van Den Dool and Kratz RI, non-polar column, temperature ramp

View large format table.

Column type Active phase I Reference Comment
CapillaryDB-51824.63Elvebak, Smith, et al., 20002. K/min; Tstart: 80. C; Tend: 300. C

References

Elvebak, Smith, et al., 2000
Elvebak, L.E., II; Smith, S.O.; Gray, G.R., Authentic standards for the reductive-cleavage method. The positional isomers of partially methylated and acetylated or benzoylated methyl 2-(acetylmethylamino)-2-deoxy-β-D-glucopyranoside, Carbohyd. Res., 2000, 329, 4, 799-805, https://doi.org/10.1016/S0008-6215(00)00260-3 . [all data]