2-O-acetyl-1,5-Anhydro-3,4-di-O-methyl-D-ribitol

Van Den Dool and Kratz RI, non-polar column, temperature ramp

Data compiled by: NIST Mass Spectrometry Data Center, William E. Wallace, director

Column type Capillary
Active phase DB-5
Column length (m) 30.
Carrier gas He
Substrate
Column diameter (mm) 0.25
Phase thickness (μm) 0.25
Tstart (C) 80.
Tend (C) 300.
Heat rate (K/min) 2.
Initial hold (min)
Final hold (min)
I 1344.54
ReferenceEl Hilali, Lamosse, et al., 2000
Comment MSDC-RI

References

El Hilali, Lamosse, et al., 2000
El Hilali, C.M.; Lamosse, T.A.; Gray, G.R., Authentic standards for the reductive-cleavage method. The positional isomers of partially methylated and acetylated or benzoylated 1,5-anhydroribitol, Carbohyd. Res., 2000, 329, 1, 189-194, https://doi.org/10.1016/S0008-6215(00)00172-5 . [all data]