8(E),10(Z)-Tetradeca-8,10-dienal

Kovats' RI, non-polar column, isothermal

View large format table.

Column type Active phase Temperature (C) I Reference Comment
CapillaryDB-1170.1624.Svatoz, Kalinová, et al., 199930. m/0.25 mm/0.25 μm
CapillaryDB-5170.1674.Svatoz, Kalinová, et al., 199930. m/0.25 mm/0.25 μm

Normal alkane RI, non-polar column, temperature ramp

View large format table.

Column type Active phase I Reference Comment
CapillaryDB-11624.Kalinová, Svatos, et al., 200330. m/0.25 mm/0.25 μm, He, 5. K/min; Tstart: 140. C; Tend: 240. C
CapillaryDB-11623.9Svatos, Kalinová, et al., 200130. m/0.25 mm/0.25 μm, 5. K/min; Tstart: 140. C; Tend: 240. C
CapillaryDB-51674.3Svatos, Kalinová, et al., 200130. m/0.25 mm/0.25 μm, 5. K/min; Tstart: 140. C; Tend: 240. C

Normal alkane RI, non-polar column, custom temperature program

View large format table.

Column type Active phase I Reference Comment
CapillaryDB-51674.Kalinová, Svatos, et al., 200330. m/0.25 mm/0.25 μm, He; Program: 70 0C (2 min) 4 K/min -> 140 0C 5 K/min -> 220 0C 20 K/min -> 280 0C (5 min)

Normal alkane RI, polar column, temperature ramp

View large format table.

Column type Active phase I Reference Comment
CapillaryDB-Wax2032.Kalinová, Svatos, et al., 200330. m/0.25 mm/0.25 μm, He, 5. K/min; Tstart: 140. C; Tend: 240. C
CapillaryDB-Wax2031.8Svatos, Kalinová, et al., 200130. m/0.25 mm/0.25 μm, 5. K/min; Tstart: 140. C; Tend: 240. C
CapillaryDB-Wax2032.Svatoz, Kalinová, et al., 199930. m/0.25 mm/0.25 μm, 5. K/min; Tstart: 140. C; Tend: 240. C

References

Svatoz, Kalinová, et al., 1999
Svatoz, A.; Kalinová, B.; Hoskovec, M.; Kindl, J.; Hovorka, O.; Hrdý, I., Identification of a new lepidopteran sex pheromone in picogram quantities using an antennal biodetector: (8E, 10Z)-tetradeca-8,10-dienal from Cameraria ohridella, Tetrahedron Lett., 1999, 40, 38, 7011-7014, https://doi.org/10.1016/S0040-4039(99)01426-4 . [all data]

Kalinová, Svatos, et al., 2003
Kalinová, B.; Svatos, A.; Kindl, J.; Hovorka, O.; Hrdý, I.; Kuldova, J.; Hoskovec, M., Sex pheromone of horse-chestnut leafminer Cameraria ohridella and its use in a pheromone-based monitoring system, J. Chem. Ecol., 2003, 29, 2, 387-404, https://doi.org/10.1023/A:1022686029051 . [all data]

Svatos, Kalinová, et al., 2001
Svatos, A.; Kalinová, B.; Hoskovec, M.; Kindl, J.; Hovorka, O.; Hrdy, I., Identification of Cameraria ohridella sex pheromone and its possible use in horse chestnut protection, IOBC Bull., 2001, 24, 2, 5-12. [all data]