8-methylbenzo[b]naphtho[2,1-d]thiopene
- Formula: C17H12S
- Molecular weight: 248.342
- IUPAC Standard InChIKey: VLPKNFOLGLSAFS-UHFFFAOYSA-N
- Chemical structure:
View 3d structure (requires JavaScript / HTML 5) - Other names: Benzo[b]naphtho[2,1]thiophene, 8-methyl

Lee's RI, non-polar column, temperature ramp

Column type | Active phase | I | Reference | Comment |
---|---|---|---|---|
Capillary | DB-5 | 407.6 | Palmentier, Britten, et al., 1989 | 80. C @ 1. min, 3.5 K/min, 300. C @ 10. min; Column length: 30. m; Column diameter: 0.32 mm |
Capillary | DB-5 | 407.7 | Palmentier, Britten, et al., 1989 | 80. C @ 1. min, 3.5 K/min, 300. C @ 10. min; Column length: 30. m; Column diameter: 0.32 mm |

Lee's RI, non-polar column, custom temperature program

Column type | Active phase | I | Reference | Comment |
---|---|---|---|---|
Capillary | DB-5 | 406.22 | Mössner, de Alda, et al., 1999 | 60. m/0.25 mm/0.25 μm, He; Program: 60C (1 min) => 45 C/min => 150C (2 min) => 2 C/min => 300 C (25 min) |

References

Palmentier, Britten, et al., 1989
Palmentier, J.-P.F.; Britten, A.J.; Charbonneau, G.M.; Karasek, F.W.,
Determination of polycyclic aromatic hydrocarbons in lubricating oil base stocks using high-performance liquid chromatography and gas chromatography-mass spectrometry,
J. Chromatogr., 1989, 469, 241-251, https://doi.org/10.1016/S0021-9673(01)96459-3
. [all data]
Mössner, de Alda, et al., 1999
Mössner, S.G.; de Alda, M.J.L.; Sander, L.C.; Lee, M.L.; Wise, S.A.,
Gas chromatographic retention behavior of polycyclic aromatic sulfur heterocyclic compounds, (dibenzothiophene, naphtho[b]thiophenes, benzo[b]naphthothiophenes and alkyl-substituted derivatives) on stationary phases of different selectivity,
J. Chromatogr. A, 1999, 841, 2, 207-228, https://doi.org/10.1016/S0021-9673(99)00363-5
. [all data]