1,3-Dioxane, 2-(1-methylbutyl)-4-pentyl, 2R,4R

Normal alkane RI, polar column, temperature ramp

View large format table.

Column type Active phase I Reference Comment
CapillaryCP-Wax1660.Kavvadias, Beuerle, et al., 199930. m/0.25 mm/0.25 μm, He, 50. C @ 3. min, 4. K/min; Tend: 240. C

References

Kavvadias, Beuerle, et al., 1999
Kavvadias, D.; Beuerle, T.; Wein, M.; Boss, B.; König, T.; Schwab, W., Novel 1,3-dioxanes from apple juice and cider, J. Agric. Food Chem., 1999, 47, 12, 5178-5183, https://doi.org/10.1021/jf990714x . [all data]