2,5-di-O-acetyl-1,4-Anhydro-3-O-methyl-D-ribitol

Van Den Dool and Kratz RI, non-polar column, temperature ramp

View large format table.

Column type Active phase I Reference Comment
CapillaryDB-51480.59Rozanas, Wang, et al., 199530. m/0.25 mm/0.25 μm, He, 2. K/min; Tstart: 80. C; Tend: 300. C

References

Rozanas, Wang, et al., 1995
Rozanas, C.R.; Wang, N.; Vidlock, K.; Gray, G.R., Synthesis and characterization of authentic standards for the analysis of ribofuranose-containing carbohydrates by the reductive-cleavage method, Carbohyd. Res., 1995, 274, 99-110, https://doi.org/10.1016/0008-6215(95)00096-C . [all data]