2,3-Di-O-acetyl-1,4-Anhydro-5-O-methyl-D-ribitol

Van Den Dool and Kratz RI, non-polar column, temperature ramp

Data compiled by: NIST Mass Spectrometry Data Center, William E. Wallace, director

Column type Capillary
Active phase DB-5
Column length (m) 30.
Carrier gas He
Substrate
Column diameter (mm) 0.25
Phase thickness (μm) 0.25
Tstart (C) 80.
Tend (C) 300.
Heat rate (K/min) 2.
Initial hold (min)
Final hold (min)
I 1460.43
ReferenceRozanas, Wang, et al., 1995
Comment MSDC-RI

References

Rozanas, Wang, et al., 1995
Rozanas, C.R.; Wang, N.; Vidlock, K.; Gray, G.R., Synthesis and characterization of authentic standards for the analysis of ribofuranose-containing carbohydrates by the reductive-cleavage method, Carbohyd. Res., 1995, 274, 99-110, https://doi.org/10.1016/0008-6215(95)00096-C . [all data]