2-methyl-3-(2-methyl-3-furanyldithio)thiophene

Van Den Dool and Kratz RI, non-polar column, custom temperature program

View large format table.

Column type Active phase I Reference Comment
CapillaryDB-51727.Mottram and Whitfield, 1995He; Column length: 50. m; Column diameter: 0.32 mm; Program: 0C => 60C/min => 60C (5min) => 4C/min => 250C

References

Mottram and Whitfield, 1995
Mottram, D.S.; Whitfield, F.B., Volatile compounds from the reaction of cysteine, ribose, and phospholipid in low-moisture systems, J. Agric. Food Chem., 1995, 43, 4, 984-988, https://doi.org/10.1021/jf00052a027 . [all data]