5-Cholesten-3-β,7-α,27-triol, TMS

Normal alkane RI, non-polar column, custom temperature program

Data compiled by: NIST Mass Spectrometry Data Center, William E. Wallace, director

Column type Capillary
Active phase Ultra-1
Column length (m) 25.
Carrier gas
Substrate
Column diameter (mm) 0.32
Phase thickness (μm) 0.17
Program 50C (3min) => (rapidly) => 185C => 5C/min => 280C
I 3445.
ReferenceAxelson and Larsson, 1996
Comment MSDC-RI

References

Axelson and Larsson, 1996
Axelson, M.; Larsson, O., 27-Hydroxylated low density lipoprotein (LDL) cholesterol can be converted to 7α,27-Dihydroxy-4-cholesten-3-one (cytosterone) before suppressing cholesterol production in normal human fibroblasts. Evidence that an altered metabolism of LDL cholesterol can underlie a defective feedback control in malignant cells, J. Biol. Chem., 1996, 271, 22, 12724-12736. [all data]