2-Isothiocyanato-4-methylpentanoic acid ethyl ester
- Formula: C9H15NO2S
- Molecular weight: 201.286
- IUPAC Standard InChIKey: VHNAJHMXSVGFSZ-UHFFFAOYSA-N
- Chemical structure:
View 3d structure (requires JavaScript / HTML 5) - Permanent link for this species. Use this link for bookmarking this species for future reference.

Kovats' RI, non-polar column, isothermal

Column type | Active phase | Temperature (C) | I | Reference | Comment |
---|---|---|---|---|---|
Packed | UCW-98 | 160. | 1355.4 | Rajniaková and Floch, 1993 | N2, Chromosorb WAW DNCS; Column length: 1.8 m |

References

Rajniaková and Floch, 1993
Rajniaková, O.; Floch, L.,
Study of the properties of ethyl isothiocyanatocarboxylates by means of gas chromatography and mass spectroscopy,
Chem. Pap., 1993, 47, 2, 106-108. [all data]