8-methyl-2,3,7-trichlorodibenzodioxin

Van Den Dool and Kratz RI, non-polar column, custom temperature program

View large format table.

Column type Active phase I Reference Comment
CapillaryDB-52287.Lundgren, Rappe, et al., 1991He; Column length: 60. m; Program: 100C(2min) => 15C/min => 200C => 2C/min => 280C

References

Lundgren, Rappe, et al., 1991
Lundgren, K.; Rappe, C.; Buser, H.-R., Detection of alkylated polychlorodibenzofurans and alkylated polychlorodibenzo-p-dioxins by tandem mass spectrometry for the analysis of crustacean samples, Chemosphere, 1991, 23, 11-12, 1591-1604, https://doi.org/10.1016/0045-6535(91)90007-Z . [all data]