1,2,4,7,8-pentabromo-dibenzofuran

Van Den Dool and Kratz RI, non-polar column, temperature ramp

Data compiled by: NIST Mass Spectrometry Data Center, William E. Wallace, director

Column type Capillary
Active phase RTX-5
Column length (m) 60.
Carrier gas He
Substrate
Column diameter (mm) 0.25
Phase thickness (μm) 0.25
Tstart (C) 170.
Tend (C) 320.
Heat rate (K/min) 1.
Initial hold (min)
Final hold (min)
I 3094.
ReferenceDonnelly, Munslow, et al., 1991
Comment MSDC-RI

References

Donnelly, Munslow, et al., 1991
Donnelly, J.R.; Munslow, W.D.; Grange, A.H.; Pettit, T.L.; Simmons, R.D.; Sovocool, G.W., Correlation of structure with linear retention index for bromo- and bromochlorodibenzo-p-dioxins and bromodibenzofurans, J. Chromatogr., 1991, 540, 293-310, https://doi.org/10.1016/S0021-9673(01)88817-8 . [all data]