sandaracopimarinol

Kovats' RI, non-polar column, isothermal

View large format table.

Column type Active phase Temperature (C) I Reference Comment
PackedOV-101200.2240.Kosyukova and Khorguani, 1989Chromaton N-AW-DMCS; Column length: 2.5 m
PackedOV-101210.2251.Kosyukova and Khorguani, 1989Chromaton N-AW-DMCS; Column length: 2.5 m

References

Kosyukova and Khorguani, 1989
Kosyukova, L.V.; Khorguani, T.V., Retention indices of diterpenes isolated from resins of coniferous trees, Zh. Anal. Khim., 1989, 44, 9, 1309-1313. [all data]