Estrone, TMS

Kovats' RI, non-polar column, isothermal

View large format table.

Column type Active phase Temperature (C) I Reference Comment
PackedOV-1225.2578.Voelter, Jung, et al., 1971N2, GasChrom Q

Van Den Dool and Kratz RI, non-polar column, temperature ramp

View large format table.

Column type Active phase I Reference Comment
CapillaryDB-52617.Gerhardt, Ludwig-Köhn, et al., 198925. m/0.32 mm/0.25 μm, H2, 2. K/min; Tstart: 120. C; Tend: 270. C

Normal alkane RI, non-polar column, temperature ramp

View large format table.

Column type Active phase I Reference Comment
PackedSE-302562.Harvey, 1980N2, Gas Chrom Q, 4. K/min; Column length: 2. m; Tstart: 150. C; Tend: 300. C
CapillarySE-302550.Fels, Dehennin, et al., 197520. m/0.25 mm/0.33 μm, 1.3 K/min; Tstart: 200. C; Tend: 250. C
CapillarySE-302577.Fels, Dehennin, et al., 197520. m/0.25 mm/0.33 μm, 200. C @ 10. min, 2.2 K/min; Tend: 250. C

References

Voelter, Jung, et al., 1971
Voelter, W.; Jung, G.; Breitmaier, E.; Bouchon, G.; Bayer, E.; Gupta, D., Comparison of the trifluoroacetyl and trimethylsilylether derivaties for gas chromatography of steroids, Anal. Chim. Acta., 1971, 53, 1, 185-188, https://doi.org/10.1016/S0003-2670(01)80085-4 . [all data]

Gerhardt, Ludwig-Köhn, et al., 1989
Gerhardt, K.; Ludwig-Köhn, H.; Henning, H.V.; Remberg, G.; Zeeck, A., Identification of oestrogen metabolites in human urine by capillary gas chromatography and mass spectrometry, Biomed. Environ. Mass Spectrom., 1989, 18, 2, 87-95, https://doi.org/10.1002/bms.1200180202 . [all data]

Harvey, 1980
Harvey, D.J., Vinyldimethylsilyl ethers as derivative for the characterization of steroids and cannabinoids by gas chromatography mass spectrometry, Biomed. Mass Spectrom., 1980, 7, 5, 211-216, https://doi.org/10.1002/bms.1200070507 . [all data]

Fels, Dehennin, et al., 1975
Fels, J.P.; Dehennin, L.; Scholler, R., Determination of estrogenes by gas-liquid chromatography with an open tubular column, J. Steroid Biochem., 1975, 6, 7, 1201-1203, https://doi.org/10.1016/0022-4731(75)90103-X . [all data]