3,11,20,21-Tetrahydroxypregnane, tetrakis-TMS

Van Den Dool and Kratz RI, non-polar column, temperature ramp

View large format table.

Column type Active phase I Reference Comment
CapillarySE-303158.Ludwig-Köhn, Sziedat, et al., 1980He, 2. K/min; Column length: 20. m; Tstart: 150. C; Tend: 295. C

References

Ludwig-Köhn, Sziedat, et al., 1980
Ludwig-Köhn, H.; Sziedat, A.; Spiteller, G.; Matthaei, D.; Henning, H.V.; Scheler, F., Occurrence of highly oxygen-substituted androgens in hemofiltrates of uremic patients, Biomed. Mass Spectrom., 1980, 7, 7, 284-287, https://doi.org/10.1002/bms.1200070704 . [all data]