N-(3-methylphenyl)-N'-(3-chlorophenyl)formamidine

Kovats' RI, non-polar column, isothermal

Data compiled by: NIST Mass Spectrometry Data Center, William E. Wallace, director

Column type Packed
Active phase SE-30
Column length (m) 1.
Carrier gas N2
Substrate Chromosorb W AW (60-80 mesh)
Column diameter (mm)
Phase thickness (μm)
Temperature (C) 240.
I 2296.
ReferenceOsek, Jaroszewska-Manaj, et al., 1986
Comment MSDC-RI

References

Osek, Jaroszewska-Manaj, et al., 1986
Osek, J.; Jaroszewska-Manaj, J.; Krawczyk, W.; Oszczapowicz, J., Gas chromatographic analysis of tautomerizing amidines. Retention indices of N,N'-diphenylformamidines on a non-polar column, J. Chromatogr., 1986, 369, 398-402, https://doi.org/10.1016/S0021-9673(00)90146-8 . [all data]