2-(tert-Butyl-dimethyl-silanyloxy)- 3-isopropyl-quinoxaline
- Formula: C17H26N2OSi
- Molecular weight: 302.4866
- IUPAC Standard InChIKey: BSNDWGRNKUVUAH-UHFFFAOYSA-N
- Chemical structure:
View 3d structure (requires JavaScript / HTML 5) - Permanent link for this species. Use this link for bookmarking this species for future reference.

Van Den Dool and Kratz RI, non-polar column, temperature ramp

Column type | Active phase | I | Reference | Comment |
---|---|---|---|---|
Packed | OV-101 | 1839. | Langenbeck, Luthe, et al., 1985 | N2, Chrom W-AWDM-CS, 2. K/min; Column length: 1.8 m; Tstart: 50. C; Tend: 200. C |

References

Langenbeck, Luthe, et al., 1985
Langenbeck, U.; Luthe, H.; Schaper, G.,
Keto acids in tissues and biological fluids: O-t-butyldimethylsilyl quinoxalinols as derivatives for sensitive gas chromatographic/mass spectrometric determination,
Biomed. Mass Spectrom., 1985, 12, 9, 507-509, https://doi.org/10.1002/bms.1200120912
. [all data]