Tripropylene glycol, monoallyl ether, acetate

Van Den Dool and Kratz RI, non-polar column, temperature ramp

View large format table.

Column type Active phase I Reference Comment
PackedSE-301602.Gnauck, 1984N2, Chromosorb W AW DMCS, 10. K/min; Column length: 2. m; Tstart: 50. C
PackedSE-301602.Gnauck, 1984N2, Chromosorb W AW DMCS, 4. K/min; Column length: 2. m; Tstart: 50. C
PackedSE-301600.Gnauck, 1984N2, Chromosorb W AW DMCS, 6. K/min; Column length: 2. m; Tstart: 50. C
PackedSE-301602.Gnauck, 1984N2, Chromosorb W AW DMCS, 8. K/min; Column length: 2. m; Tstart: 50. C
PackedSE-301600.Gnauck, 1984N2, Chromosorb W AW DMCS, 10. K/min; Column length: 2. m; Tstart: 70. C
PackedSE-301604.Gnauck, 1984N2, Chromosorb W AW DMCS, 4. K/min; Column length: 2. m; Tstart: 70. C
PackedSE-301600.Gnauck, 1984N2, Chromosorb W AW DMCS, 6. K/min; Column length: 2. m; Tstart: 70. C
PackedSE-301601.Gnauck, 1984N2, Chromosorb W AW DMCS, 8. K/min; Column length: 2. m; Tstart: 70. C
PackedSE-301603.Gnauck, 1984N2, Chromosorb W AW DMCS, 10. K/min; Column length: 2. m; Tstart: 90. C
PackedSE-301601.Gnauck, 1984N2, Chromosorb W AW DMCS, 4. K/min; Column length: 2. m; Tstart: 90. C
PackedSE-301604.Gnauck, 1984N2, Chromosorb W AW DMCS, 6. K/min; Column length: 2. m; Tstart: 90. C
PackedSE-301601.Gnauck, 1984N2, Chromosorb W AW DMCS, 8. K/min; Column length: 2. m; Tstart: 90. C

References

Gnauck, 1984
Gnauck, R., Gaschromatographische Trennung und Identifizierung Polyfunktioneller Polyetheralkohole, J. Chromatogr., 1984, 284, 87-96, https://doi.org/10.1016/S0021-9673(01)87804-3 . [all data]