7β,16α,17-triOH-kauranoic acid, methyl ester TMS ether

Van Den Dool and Kratz RI, non-polar column, custom temperature program

View large format table.

Column type Active phase I Reference Comment
CapillaryOV-12862.Gaskin, Gilmour, et al., 1984He; Column length: 25. m; Column diameter: 0.2 mm; Program: 60C(2min) => 13C/min => 150C => 3C/min => 280C(10min)

References

Gaskin, Gilmour, et al., 1984
Gaskin, P.; Gilmour, S.J.; Lenton, J.R.; MacMillan, J.; Sponsel, V.M., Endogenous gibberellins and kauranoids identified from developing and germinating barley grain, J. Plant Growth Regul., 1984, 2, 1-4, 229-242, https://doi.org/10.1007/BF02042252 . [all data]