3'-chloro,4'-methylbutyroanilide

Kovats' RI, non-polar column, isothermal

View large format table.

Column type Active phase Temperature (C) I Reference Comment
PackedSE-30170.1835.Sharif'yanova and Vigdergauz, 1981Cromaton N-AW-DMCS; Column length: 1. m

References

Sharif'yanova and Vigdergauz, 1981
Sharif'yanova, L.N.; Vigdergauz, M.S., Gas-chromatographic studies of aliphatic carboxylic-acid anilides, Zh. Anal. Khim., 1981, 36, 11, 1589-1593. [all data]