trans-3,cis-5-octadiene

Kovats' RI, non-polar column, isothermal

View large format table.

Column type Active phase Temperature (C) I Reference Comment
CapillarySqualane70.830.6Soják, Král'ovicová, et al., 1984195. m/0.25 mm/0.08 μm, H2
CapillarySqualane70.835.9Soják, Ostrovský, et al., 1980N2; Column length: 200. m; Column diameter: 0.25 mm
CapillarySqualane70.831.1Soják, Ostrovský, et al., 1980N2; Column length: 70. m; Column diameter: 0.25 mm

References

Soják, Král'ovicová, et al., 1984
Soják, L.; Král'ovicová, E.; Ostrovský, I.; Leclercq, P.A., Retention behaviour of conjegated and isolated n-alkadienes. Identification of n-nona- and n-decadiens by capillary gas chromatography using structure-retention correlations and mass spectrometry, J. Chromatogr., 1984, 292, 1, 241-261, https://doi.org/10.1016/S0021-9673(01)96207-7 . [all data]

Soják, Ostrovský, et al., 1980
Soják, L.; Ostrovský, I.; Leclercq, P.A.; Rijks, J.A., Identification of n-hepta- and n-octadienes by high-resolution gas chromatography using structure-retention correlations and mass spectrometry, J. Chromatogr., 1980, 191, 187-198, https://doi.org/10.1016/S0021-9673(00)86379-7 . [all data]