cis-2,trans-4-octadiene
- Formula: C8H14
- Molecular weight: 110.1968
- IUPAC Standard InChIKey: NZLCAHVLJPDRBL-ZIQCHISCSA-N
- Chemical structure:
View 3d structure (requires JavaScript / HTML 5) - Stereoisomers:
- Other names: 2,4-Octadiene, Z,E

Kovats' RI, non-polar column, isothermal

Column type | Active phase | Temperature (C) | I | Reference | Comment |
---|---|---|---|---|---|
Capillary | Squalane | 70. | 840.6 | Soják, Král'ovicová, et al., 1984 | 195. m/0.25 mm/0.08 μm, H2 |
Capillary | Squalane | 70. | 846.3 | Soják, Ostrovský, et al., 1980 | N2; Column length: 200. m; Column diameter: 0.25 mm |
Capillary | Squalane | 70. | 841.4 | Soják, Ostrovský, et al., 1980 | N2; Column length: 70. m; Column diameter: 0.25 mm |
Capillary | Squalane | 30. | 840. | Döring, Estel, et al., 1974 | Column length: 150. m; Column diameter: 0.25 mm |

References

Soják, Král'ovicová, et al., 1984
Soják, L.; Král'ovicová, E.; Ostrovský, I.; Leclercq, P.A.,
Retention behaviour of conjegated and isolated n-alkadienes. Identification of n-nona- and n-decadiens by capillary gas chromatography using structure-retention correlations and mass spectrometry,
J. Chromatogr., 1984, 292, 1, 241-261, https://doi.org/10.1016/S0021-9673(01)96207-7
. [all data]
Soják, Ostrovský, et al., 1980
Soják, L.; Ostrovský, I.; Leclercq, P.A.; Rijks, J.A.,
Identification of n-hepta- and n-octadienes by high-resolution gas chromatography using structure-retention correlations and mass spectrometry,
J. Chromatogr., 1980, 191, 187-198, https://doi.org/10.1016/S0021-9673(00)86379-7
. [all data]
Döring, Estel, et al., 1974
Döring, C.-E.; Estel, D.; Geyer, R.; Wendt, W.-H.,
Kapillargaschromatographische Analyse geradkettiger C8-Diene,
Z. Chem., 1974, 14, 7, 292-293, https://doi.org/10.1002/zfch.19740140730
. [all data]