Silane, ethoxy-, tributyloxy-

Kovats' RI, non-polar column, isothermal

View large format table.

Column type Active phase Temperature (C) I Reference Comment
PackedApiezon L160.1339.Ellrén, Peetre, et al., 1974N2, Chromosorb G
CapillaryApiezon L160.1333.5Peetre, 1974Column length: 50. m; Column diameter: 0.25 mm

Normal alkane RI, non-polar column, isothermal

View large format table.

Column type Active phase Temperature (C) I Reference Comment
PackedApieson M160.1339.Ellren, Peetre, et al., 1974Chromosorb G AW DMCS (80-100 mesh)

References

Ellrén, Peetre, et al., 1974
Ellrén, O.; Peetre, I.-B.; Smith, B.E.F., Gas chromatographic investigation of organometallic compounds and their carbon analogues. I. Determination, calculation and correlation of Kováts retention indices for tetraalkoxysilanes, J. Chromatogr., 1974, 88, 2, 295-310, https://doi.org/10.1016/S0021-9673(00)83154-4 . [all data]

Peetre, 1974
Peetre, I.-B., Gas chromatographic investigation of organometallic compounds and their carbon analogues. II. Improved method for calculating retention indices of tetraalkoxysilanes, J. Chromatogr., 1974, 88, 2, 311-321, https://doi.org/10.1016/S0021-9673(00)83155-6 . [all data]

Ellren, Peetre, et al., 1974
Ellren, O.; Peetre, I.B.; Smith, B.E.F., Gas chromatographic investigation of organometallic compounds and their carbon analogues. V. Use of refractive index in conjunction with Kovats retention index for the identification of organosilicon compounds, J. Chromatogr., 1974, 93, 2, 383-392, https://doi.org/10.1016/S0021-9673(01)85402-9 . [all data]