Hephane-d16
- Formula: C6H6D6
- Molecular weight: 90.1965
- IUPAC Standard InChIKey: XDTMQSROBMDMFD-NMFSSPJFSA-N
- Chemical structure:
View 3d structure (requires JavaScript / HTML 5) - Isotopologues:

Kovats' RI, non-polar column, isothermal

Column type | Active phase | Temperature (C) | I | Reference | Comment |
---|---|---|---|---|---|
Capillary | Apiezon L | 50. | 688. | Gäumann and Bonzo, 1973 | Column length: 100. m |

References

Gäumann and Bonzo, 1973
Gäumann, T.; Bonzo, R.,
The gas-chromatographic retention indices of deuterated compounds,
Helv. Chim. Acta, 1973, 56, 3, 1165-1176, https://doi.org/10.1002/hlca.19730560340
. [all data]