trans-Hydroxymethylcyclopropane, 2-methyl-2-phenyl

Kovats' RI, non-polar column, isothermal

View large format table.

Column type Active phase Temperature (C) I Reference Comment
PackedSE-30170.1340.Heintz, Druilhe, et al., 1977N2, Chromosorb W AW (0.20-0.25 mm); Column length: 3. m

References

Heintz, Druilhe, et al., 1977
Heintz, M.; Druilhe, A.; De Peretti, D.; Seyden, J.; Lefort, D., Relations entre structure chimique et grandeurs de retention. VII. Composés de structure cyclopropanique, Chromatographia, 1977, 10, 10, 588-592, https://doi.org/10.1007/BF02265036 . [all data]