6-ethoxy-dihydroindole

Kovats' RI, non-polar column, isothermal

View large format table.

Column type Active phase Temperature (C) I Reference Comment
PackedSE-30170.1565.Tibor and Anna, 1971N2, Chromosorb W-AW; Column length: 2. m
PackedSE-30190.1572.Tibor and Anna, 1971N2, Chromosorb W-AW; Column length: 2. m

Kovats' RI, polar column, isothermal

View large format table.

Column type Active phase Temperature (C) I Reference Comment
PackedPEG-20M170.2424.Tibor and Anna, 1971N2, Chromosorb W-AW; Column length: 2. m
PackedPEG-20M190.2434.Tibor and Anna, 1971N2, Chromosorb W-AW; Column length: 2. m

References

Tibor and Anna, 1971
Tibor, T.; Anna, B., Gázkromatográfiás retenció és a kémiai szerkezet, I., Magy. Kem. Foly., 1971, 77, 576-587. [all data]