threo-Benzene, (3-chloro-1,2-dimethylpropyl)

Normal alkane RI, non-polar column, temperature ramp

View large format table.

Column type Active phase I Reference Comment
CapillaryOV-1011311.Zenkevich, 2001N2, 4. K/min; Column length: 25. m; Column diameter: 0.20 mm; Tstart: 60. C; Tend: 240. C

References

Zenkevich, 2001
Zenkevich, I.G., Interpretation of Gas Chromatographic Retention Indices in estimation of Structures of Isomeric Products of Radical Chlorinating of Alkyl Arenes, Zh. Org. Khim., 2001, 37, 2, 283-293. [all data]