2,7-Octadien-1-ol, 2-methyl-6-methylene, (E)
- Formula: C10H16O
- Molecular weight: 152.2334
- IUPAC Standard InChIKey: IEVYLQISZQFFGA-YFHOEESVSA-N
- Chemical structure:
View 3d structure (requires JavaScript / HTML 5) - Stereoisomers:

Kovats' RI, non-polar column, isothermal

Column type | Active phase | Temperature (C) | I | Reference | Comment |
---|---|---|---|---|---|
Packed | Apiezon L | 150. | 1196. | ter Heide, 1976 |

Kovats' RI, polar column, isothermal

Column type | Active phase | Temperature (C) | I | Reference | Comment |
---|---|---|---|---|---|
Packed | Carbowax 20M | 150. | 1919. | ter Heide, 1976 |

References

ter Heide, 1976
ter Heide, R.,
Studies on Terpenes. III. Gas Chromatography of Acyclic Monoterpene Alcohols,
J. Chromatogr., 1976, 129, 143-154, https://doi.org/10.1016/S0021-9673(00)87776-6
. [all data]