Naphthalene, 1,2,3,4,5,6-hexachloro

Normal alkane RI, non-polar column, temperature ramp

View large format table.

Column type Active phase I Reference Comment
CapillaryDB-52472.Olivero and Kannan, 199930. m/0.25 mm/0.25 μm, He, 4. K/min; Tstart: 160. C; Tend: 280. C

References

Olivero and Kannan, 1999
Olivero, L.; Kannan, K., Quantitative structure - retention relationships of polychlorinated naphthalenes in gas chromatography, J. Chromatogr., 1999, 849, 2, 621-627, https://doi.org/10.1016/S0021-9673(99)00402-1 . [all data]