Benzene, 1-hexenyl-, (Z)

Kovats' RI, non-polar column, isothermal

View large format table.

Column type Active phase Temperature (C) I Reference Comment
CapillaryOV-101100.1249.Engewald, Topalova, et al., 1987Column length: 50. m; Column diameter: 0.30 mm

References

Engewald, Topalova, et al., 1987
Engewald, W.; Topalova, I.; Petsev, N.; Dimitrov, Chr., Structure-Retention Correlations of Hydrocarbons in GLC and GSC. Alkenylbenzenes, Chromatographia, 1987, 23, 8, 561-565, https://doi.org/10.1007/BF02324864 . [all data]