trans-2,3-Tetralinediol, DTBS
- Formula: C18H28O2Si
- Molecular weight: 304.4992
- IUPAC Standard InChIKey: ZGGDUGVGAUHMTA-HOTGVXAUSA-N
- Chemical structure:
View 3d structure (requires JavaScript / HTML 5) - Permanent link for this species. Use this link for bookmarking this species for future reference.

Normal alkane RI, non-polar column, custom temperature program

Column type | Active phase | I | Reference | Comment |
---|---|---|---|---|
Capillary | OV-1 | 1960. | Brooks, Cole, et al., 1984 | He; Column length: 25. m; Column diameter: 0.25 mm; Program: 80 0C (2 min) 30 0C/min -> 140 0C (2 min) 1.5 0C/min -> 200 0C; or: 80 0C (2 min) 30 0C/min -> 200 0C 2 0C/min -> 260 0C |

References

Brooks, Cole, et al., 1984
Brooks, C.J.W.; Cole, W.J.; Barrett, G.M.,
Studies of cyclic Di-tert.-butylsilylene derivatives of diols and hydroxy acids by gas chromatography-mass spectrometry,
J. Chromatogr., 1984, 315, 119-133, https://doi.org/10.1016/S0021-9673(01)90730-7
. [all data]