Heptane, 4-chloro-

Kovats' RI, non-polar column, isothermal

View large format table.

Column type Active phase Temperature (C) I Reference Comment
PackedApiezon L100.949.Castello and D'Amato, 1986
PackedApiezon L125.959.Castello and D'Amato, 1986
PackedApiezon L75.941.Castello and D'Amato, 1986
CapillaryApiezon L90.900.Morishita, Terashima, et al., 1983He; Column length: 45. m; Column diameter: 0.25 mm

Kovats' RI, polar column, isothermal

View large format table.

Column type Active phase Temperature (C) I Reference Comment
PackedCarbowax 20M100.1044.Castello and D'Amato, 1986He, Chromosorb W AW DMC; Column length: 3. m
PackedCarbowax 20M125.1058.Castello and D'Amato, 1986He, Chromosorb W AW DMC; Column length: 3. m
PackedCarbowax 20M75.1052.Castello and D'Amato, 1986He, Chromosorb W AW DMC; Column length: 3. m
CapillaryPEG-20M90.1054.Morishita, Terashima, et al., 1983He; Column length: 75. m; Column diameter: 0.25 mm

Normal alkane RI, non-polar column, isothermal

View large format table.

Column type Active phase Temperature (C) I Reference Comment
CapillaryApiezon L130.900.Arruda, Junkes, et al., 2008

References

Castello and D'Amato, 1986
Castello, G.; D'Amato, G., Gas chromatographic separation and identification of linear and branched-chain alkyl chlorides, J. Chromatogr., 1986, 354, 65-74, https://doi.org/10.1016/S0021-9673(01)87011-4 . [all data]

Morishita, Terashima, et al., 1983
Morishita, F.; Terashima, Y.; Ichise, M.; Kojima, T., Prediction of retention indices from molecular structures of chlorinated alkanes, J. Chromatogr. Sci., 1983, 21, 5, 209-213, https://doi.org/10.1093/chromsci/21.5.209 . [all data]

Arruda, Junkes, et al., 2008
Arruda, A.C.S.; Junkes, B. da.S.; Souza, E.S.; Yunes, R.A.; Heizen, V.E.F., Semi-Emlirical Topological Index to Predict Properties of Halogenated Aliphatic Compounds, J. Chemometrics, 2008, 22, 3-4, 186-194, https://doi.org/10.1002/cem.1121 . [all data]