Pentacyclo[4.2.0.02,5.03,8.04,7]octane, 1,4-dichloro-

Gas phase ion energetics data

Data compiled as indicated in comments:
LBLHLM - Sharon G. Lias, John E. Bartmess, Joel F. Liebman, John L. Holmes, Rhoda D. Levin, and W. Gary Mallard

Ionization energy determinations

IE (eV) Method Reference Comment
9.2PEHonegger, Heilbronner, et al., 1985LBLHLM
9.5PEHonegger, Heilbronner, et al., 1985Vertical value; LBLHLM

References

Honegger, Heilbronner, et al., 1985
Honegger, E.; Heilbronner, E.; Urbanek, T.; Martin, H.-D., Inverted hyperconjugation in symmetrical 1,4-dihalocubanes, Helv. Chim. Acta, 1985, 68, 23. [all data]