1,3-Thiazine-6-one-4-ol, 2-(4-methoxyphenyl)-

Gas phase ion energetics data

Data compiled by: Sharon G. Lias, John E. Bartmess, Joel F. Liebman, John L. Holmes, Rhoda D. Levin, and W. Gary Mallard

Ionization energy determinations

IE (eV) Method Reference Comment
8.50PEYakovlev, Mironova, et al., 1987Vertical value

References

Yakovlev, Mironova, et al., 1987
Yakovlev, I.P.; Mironova, G.A.; Timoshenko, M.M.; Chizhov, Yu.V.; Ivin, B.A., Investigation of azines and azoles. LXV. Investigation of the reaction of 2-Aryl-4-hydroxy-6-oxo-1,3-thiazines with the vilsmeier reagent by quantum chemistry and photoelectron spectroscopy, J. Org. Chem. USSR, 1987, 23, 1398. [all data]