1,2,4-Tri-isopropylbenzene

Kovats' RI, non-polar column, custom temperature program

View large format table.

Column type Active phase I Reference Comment
CapillarySqualane1201.Medvedovskaya, Tikhomirova, et al., 1997Program: not specified

Normal alkane RI, polar column, isothermal

View large format table.

Column type Active phase Temperature (C) I Reference Comment
CapillaryPEG-40M100.1524.Nesterov, Nesterova, et al., 2000Column length: 50. m
CapillaryPEG-40M120.1528.Nesterov, Nesterova, et al., 2000Column length: 50. m
CapillaryPEG-40M140.1532.Nesterov, Nesterova, et al., 2000Column length: 50. m
CapillaryPEG-40M160.1540.Nesterov, Nesterova, et al., 2000Column length: 50. m
CapillaryPEG-40M80.1520.Nesterov, Nesterova, et al., 2000Column length: 50. m

References

Medvedovskaya, Tikhomirova, et al., 1997
Medvedovskaya, I.I.; Tikhomirova, S.V.; Krasavina, T.D.; Gubkina, L.N., Comparison of results of chromatographic identification of complex mixtures of organic compounds, Proc. Omsk. Univ., 1997, 4, 34-36. [all data]

Nesterov, Nesterova, et al., 2000
Nesterov, I.A.; Nesterova, T.N.; Pimerzin, A.A.; Tsvetkov, V.S., Thermodynamics of alkylbenzene sorption and evaporation. IV. Enthalpies of evaporation and thermodynamics chracteristics of sorption by stationary phases OV-101 and PEG-40M, Izvestia vysshikh uchebnykh zavedenii. Khimia i khimicheskaia tekhnologia (Chemistry and chemical technology), 2000, 43, 4, 39-45. [all data]