2,3-Dehydro-1,8-cineole

Normal alkane RI, non-polar column, custom temperature program

Data compiled by: NIST Mass Spectrometry Data Center, William E. Wallace, director

Column type CapillaryCapillaryCapillaryCapillaryCapillary
Active phase DB-15 % Phenyl polydimethyl siloxaneDB-1DB-1DB-1
Column length (m) 30. 30.30.30.
Carrier gas Hydrogen HydrogenHydrogenHe
Substrate
Column diameter (mm) 0.25 0.250.250.25
Phase thickness (μm) 0.25 0.250.250.25
Program 45 0C 3 0C/min -> 175 0C 15 0C/min -> 300 0C (10 min)not specified45 0C 3 0C/min -> 175 0C 15 0C/min -> 300 0C (10 min)45 0C 3 0C/min -> 175 0C 15 0C/min -> 300 0C (10 min)45C => 3C/min => 175C => 15C/min => 300C (10min)
I 973.994.973.973.973.
ReferenceAlbano, Lima, et al., 2012Chaverri, Diaz, et al., 2011Mendes, Trindade, et al., 2009Mendes, Trindade, et al., 2009, 2Ferreira, Meireles de Sousa, et al., 2007
Comment MSDC-RI MSDC-RI MSDC-RI MSDC-RI MSDC-RI
Column type CapillaryCapillaryCapillaryCapillaryCapillary
Active phase DB-5MSBPX-5BPX-5 DB-1
Column length (m) 30.30.30. 30.
Carrier gas   He He
Substrate
Column diameter (mm) 0.250.250.25 0.25
Phase thickness (μm) 0.250.250.25 0.25
Program 70C(2min) => 10C/min => 150C(15min) => 5C/min => 240C60C(0.2min) => 3K/min => 186C => 10C/min => 240C (5min)50C => 3C/min => 150C (10min) => 10C/min => 250Cnot specified45C => 3C/min => 175C => 15C/min => 300C (10min)
I 1009.991.992.974.973.
ReferenceBagci and Baser, 2005Judzentiene and Mockute, 2005Kordali, Kotan, et al., 2005El-Shazily, Hafez, et al., 2004Miguel, Simões, et al., 2004
Comment MSDC-RI MSDC-RI MSDC-RI MSDC-RI MSDC-RI
Column type CapillaryCapillaryCapillaryCapillaryCapillary
Active phase SE-30DB-1CP Sil 5 CBCP Sil 5 CBCP Sil 5 CB
Column length (m)  30.25.25.30.
Carrier gas    N2N2
Substrate
Column diameter (mm)  0.250.39 0.25
Phase thickness (μm)  0.25
Program not specified45 0C 3 K/min -> 175 0C 15 K/min -> 300 0C (10 min)not specifiednot specifiednot specified
I 981.974.980.982.984.
ReferenceVinogradov, 2004Figueiredo, Miguel, et al., 2001Weyerstahl, Marschall, et al., 1999Weyerstahl, Marschall, et al., 1997Weyerstahl, Marschall, et al., 1997, 2
Comment MSDC-RI MSDC-RI MSDC-RI MSDC-RI MSDC-RI
Column type Capillary
Active phase Polydimethyl siloxanes
Column length (m)
Carrier gas
Substrate
Column diameter (mm)
Phase thickness (μm)
Program not specified
I 981.
ReferenceZenkevich, 1997
Comment MSDC-RI

Van Den Dool and Kratz RI, non-polar column, temperature ramp

Data compiled by: NIST Mass Spectrometry Data Center, William E. Wallace, director

Column type CapillaryCapillaryCapillaryCapillaryCapillary
Active phase DB-5DB-5RTX-1HP-5MSHP-5
Column length (m) 30.50.60.30.30.
Carrier gas HeN2 He
Substrate
Column diameter (mm) 0.250.20.220.250.25
Phase thickness (μm) 0.250.320.250.250.25
Tstart (C) 60.60.60.60.60.
Tend (C) 240.220.220.250.220.
Heat rate (K/min) 3.5.2.4.5.
Initial hold (min)  3. 2.10.
Final hold (min)  5.20.20.
I 994.991.979.990.993.
ReferenceBaccouri, Ben Temime, et al., 2007Esmaeili, Nematollahi, et al., 2006Cozzani, Muselli, et al., 2005Pino, Mesa, et al., 2005Ceccarini, Macchia, et al., 2004
Comment MSDC-RI MSDC-RI MSDC-RI MSDC-RI MSDC-RI
Column type CapillaryCapillaryCapillaryCapillaryCapillary
Active phase DB-5OV-1HP-5HP-5HP-5
Column length (m) 30.25.30.30.30.
Carrier gas HeH2N2N2N2
Substrate
Column diameter (mm) 0.250.250.250.250.25
Phase thickness (μm) 0.250.30.250.250.25
Tstart (C) 60.50.60.60.60.
Tend (C) 240.200.220.220.220.
Heat rate (K/min) 3.3.5.5.5.
Initial hold (min)  1.10.10.10.
Final hold (min)  20.
I 992.978.1000.994.993.
ReferenceBader, Flamini, et al., 2003Bicchi, Rubiolo, et al., 2003Campeol, Flamini, et al., 2003Campeol, Flamini, et al., 2003Dural, Bagci, et al., 2003
Comment MSDC-RI MSDC-RI MSDC-RI MSDC-RI MSDC-RI
Column type CapillaryCapillaryCapillaryCapillaryCapillary
Active phase DB-5HP-5DB-5SPB-1CP Sil 5 CB
Column length (m) 30.30.30.15.25.
Carrier gas HeN2He He
Substrate
Column diameter (mm) 0.250.250.250.250.25
Phase thickness (μm) 0.250.250.250.25
Tstart (C) 60.60.60.35.60.
Tend (C) 240.220.260.225.260.
Heat rate (K/min) 3.5.4.6.5.
Initial hold (min)  10. 3.
Final hold (min)    10.
I 994.993.992.975.981.
ReferenceFlamini, Luigi Cioni, et al., 2003Flamini, Cioni, et al., 2002Javidnia, Miri, et al., 2002Chisholm, Wilson, et al., 2001Weyerstahl, Marschall, et al., 1999
Comment MSDC-RI MSDC-RI MSDC-RI MSDC-RI MSDC-RI
Column type Capillary
Active phase OV-1
Column length (m) 25.
Carrier gas
Substrate
Column diameter (mm) 0.25
Phase thickness (μm) 0.3
Tstart (C) 50.
Tend (C) 200.
Heat rate (K/min) 3.
Initial hold (min) 1.
Final hold (min) 20.
I 978.
ReferenceBicchi, Rubiolo, et al., 1998
Comment MSDC-RI

Kovats' RI, non-polar column, temperature ramp

Data compiled by: NIST Mass Spectrometry Data Center, William E. Wallace, director

Column type CapillaryCapillaryCapillaryCapillaryCapillary
Active phase DB-5DB-5DB-5BP-1HP-5
Column length (m) 30.30.30.30.30.
Carrier gas H2HeHeN2He
Substrate
Column diameter (mm) 0.250.250.250.320.25
Phase thickness (μm) 0.250.250.250.250.25
Tstart (C) 40.60.60.60.60.
Tend (C) 280.240.240.220.280.
Heat rate (K/min) 4.3.3.5.4.
Initial hold (min)
Final hold (min) 30.30.30.13.
I 975.972.972.980.986.
ReferenceAvato, Raffo, et al., 2004Marongiu, Piras, et al., 2003Marongiu, Piras, et al., 2003Shawl, Srivastava, et al., 2002Sajjadi and Ghassemi, 1999
Comment MSDC-RI MSDC-RI MSDC-RI MSDC-RI MSDC-RI
Column type Capillary
Active phase DB-1
Column length (m) 60.
Carrier gas He
Substrate
Column diameter (mm) 0.25
Phase thickness (μm) 0.25
Tstart (C) 50.
Tend (C) 250.
Heat rate (K/min) 3.
Initial hold (min) 5.
Final hold (min) 10.
I 975.
ReferenceBylaite, Venskutonis, et al., 1998
Comment MSDC-RI

Van Den Dool and Kratz RI, polar column, temperature ramp

Data compiled by: NIST Mass Spectrometry Data Center, William E. Wallace, director

Column type CapillaryCapillary
Active phase RTX-WaxCarbowax 20M
Column length (m) 60.25.
Carrier gas  He
Substrate
Column diameter (mm) 0.220.25
Phase thickness (μm) 0.250.3
Tstart (C) 60.50.
Tend (C) 220.200.
Heat rate (K/min) 2.3.
Initial hold (min)  1.
Final hold (min) 20.20.
I 1197.1195.
ReferenceCozzani, Muselli, et al., 2005Bicchi, Rubiolo, et al., 2003
Comment MSDC-RI MSDC-RI

Kovats' RI, non-polar column, custom temperature program

Data compiled by: NIST Mass Spectrometry Data Center, William E. Wallace, director

Column type Capillary
Active phase OV-1
Column length (m) 30.
Carrier gas He
Substrate
Column diameter (mm) 0.25
Phase thickness (μm) 0.25
Program 44C(4min) => 3C/min => 74C => 6C/min => 134C => 12C/min => 312C
I 973.
ReferenceEl-Shazly, Dorai, et al., 2002
Comment MSDC-RI

References

Albano, Lima, et al., 2012
Albano, S.M.; Lima, A.S.; Miguel, M.G.; Pedro, L.G.; Barroso, J.G.; Figueiredo, A.C., Antioxidant, anti-5-lipoxygenase and antiacetylcholinesterase activities of essential oils and decoction water of some aromatic plants, Rec. Nat. Prod., 2012, 6, 1, 35-48. [all data]

Chaverri, Diaz, et al., 2011
Chaverri, C.; Diaz, C.; Cicco, J.F., Chemical analysis of essential oils from Ocotea gomezii W.C. Burger and Ocotea morae Gomez-Laur. (Lauraceae) collected at Reserva biologica Alberto M. Brenes in Costa Rica and their cytotoxic activity on Tumor cell lines, J. Braz. Chem. Soc., 2011, 22, 4, s1-s4, https://doi.org/10.1590/S0103-50532011000400018 . [all data]

Mendes, Trindade, et al., 2009
Mendes, M.D.; Trindade, H.; Figueiredo, A.C.; Pedro, L.G.; Barroso, J.G., Chaerophyllum azoricun Trel. grown in the Azores archipelago, Portugal: evaluation of the genetic diversity using molecular markers and comparison with volatile oils profiles, Flavour Fragr. J., 2009, 24, 5, 259-265, https://doi.org/10.1002/ffj.1939 . [all data]

Mendes, Trindade, et al., 2009, 2
Mendes, M.D.; Trindade, H.; Figueiredo, A.C.; Barroso, J.G.; Fontinha, S.S.; Pedro, L.G., Volatile and molecular characterization of two Portuguese endemic species: Angelica lignescens and Melanoselinium decipiens, Biochen. Systematics Ecol., 2009, 37, 2, 98-105, https://doi.org/10.1016/j.bse.2008.12.006 . [all data]

Ferreira, Meireles de Sousa, et al., 2007
Ferreira, N.J.; Meireles de Sousa, I.G.; Luís, T.C.; Currais, A.J.M.; Figueiredo, C.; Cost, M.M.; Lima, A.S.B.; Santos, P.A.G.; Barroso, J.G.; Pedro, L.G.; Scheffer, J.J.C., Pittosporum undulatum Vent. grown in Portugal: secretory structures, seasonal variation and enantiomeric composition of its essential oil, Flavour Fragr. J., 2007, 22, 1, 1-9, https://doi.org/10.1002/ffj.1748 . [all data]

Bagci and Baser, 2005
Bagci, E.; Baser, K.H.C., Study of the essential oils of Thymus haussknechtii Velen and Thymus kotschyanus Boiss. et Hohen var. kotschyanus (Lamiaceae) taxa from the eastern Anatolian region in Turkey, Flavour Fragr. J., 2005, 20, 2, 199-202, https://doi.org/10.1002/ffj.1397 . [all data]

Judzentiene and Mockute, 2005
Judzentiene, A.; Mockute, D., The inflorescence and leaf essential oils of Tanacetum vulgare L. var. vulgare growing wild in Lithuania, Biochem. Syst. Ecol., 2005, 33, 5, 487-498, https://doi.org/10.1016/j.bse.2004.11.003 . [all data]

Kordali, Kotan, et al., 2005
Kordali, S.; Kotan, R.; Mavi, A.; Cakir, A.; Ala, A.; Yildirim, A., Determination of the chemical composition and antioxidant activity of the essential oil of Artemisia dracunculus and of the antifungal and antibacterial activities of Turkish Artemisia absinthium, A. dracunculus, Artemisia santonicum, and Artemisia spicigera essential oils, J. Agric. Food Chem., 2005, 53, 9452-9458. [all data]

El-Shazily, Hafez, et al., 2004
El-Shazily, A.M.; Hafez, S.S.; Wink, M., Comparative study of the essential oils and extracts of Achillea fragrantissima (Forssk.) Sch. Bip. and Achillea santolina L. (Asteraceae) from Egypt, Pharmazie, 2004, 59, 226-230. [all data]

Miguel, Simões, et al., 2004
Miguel, G.; Simões, M.; Figueiredo, A.C.; Barroso, J.G.; Pedro, L.G.; Carvalho, L., Composition and antioxidant activities of the essential oils of Thymus caespititius, Thymus camphoratus and Thymus mastichina, Food Chem., 2004, 86, 2, 183-188, https://doi.org/10.1016/j.foodchem.2003.08.031 . [all data]

Vinogradov, 2004
Vinogradov, B.A., Production, composition, properties and application of essential oils, 2004, retrieved from http://viness.narod.ru. [all data]

Figueiredo, Miguel, et al., 2001
Figueiredo, A.C.; Miguel, M.G.; Duarte, A.M.F.; Barroso, J.G.; Pedro, L.G., Essential oil composition of Thymus lotocephallus G. López R. Morales, collected during flowering and vegetative phases, Flavour Fragr. J., 2001, 16, 6, 417-421, https://doi.org/10.1002/ffj.1028 . [all data]

Weyerstahl, Marschall, et al., 1999
Weyerstahl, P.; Marschall, H.; Splittgerber, U.; Son, P.T.; Giang, P.M.; Kaul, V.K., Constituents of the essential oil from the fruits of Zanthoxylum rhetsoides Drake from Vietnam and from the aerial parts of Zanthoxylum alatum Roxb. from India, Flavour Fragr. J., 1999, 14, 4, 225-229, https://doi.org/10.1002/(SICI)1099-1026(199907/08)14:4<225::AID-FFJ818>3.0.CO;2-1 . [all data]

Weyerstahl, Marschall, et al., 1997
Weyerstahl, P.; Marschall, H.; Seelmann, I.; Kaul, V.K., Constituents of the flower essential oil of Ageratina adenophora (Spreng.) K. et R. from India, Flavour Fragr. J., 1997, 12, 6, 387-396, https://doi.org/10.1002/(SICI)1099-1026(199711/12)12:6<387::AID-FFJ677>3.0.CO;2-F . [all data]

Weyerstahl, Marschall, et al., 1997, 2
Weyerstahl, P.; Marschall, H.; Seelmann, I.; Rustaiyan, A., Constituents of the essential oil of Achillea eriophora DC, Flavour Fragr. J., 1997, 12, 2, 71-78, https://doi.org/10.1002/(SICI)1099-1026(199703)12:2<71::AID-FFJ620>3.0.CO;2-E . [all data]

Zenkevich, 1997
Zenkevich, I.G., Analytical Parameters of Components of Essential Oils for their Chromatographic and Chromato-Spectral Identificaiton. Oxsigenated derivatives of Mono- and Sesquiterpene Hydrocarbons, Rastit, Resursy (Rus.), 1997, 33, 1, 16-28. [all data]