Cyclohexanecarboxylic acid, octyl ester

Kovats' RI, non-polar column, isothermal

View large format table.

Column type Active phase Temperature (C) I Reference Comment
CapillaryDB-1160.1706.03Mijin and Antonovic, 200630. m/0.256 mm/0.25 μm, N2
CapillaryDB-5160.1709.83Mijin and Antonovic, 200660. m/0.321 mm/0.25 μm, N2

References

Mijin and Antonovic, 2006
Mijin, D.; Antonovic, D.G., The temperature dependence of the retention index for n-alkyl esters of acetic, propionic, cyclohexanecarboxylic, benzoic and phenylacetic acid on DB-1 and DB-5 capillary columns, J. Serb. Chem. Soc., 2006, 71, 6, 629-637, https://doi.org/10.2298/JSC0606629M . [all data]