2,5-Etheno[4.2.2]propella-3,7,9-triene
- Formula: C12H10
- Molecular weight: 154.2078
- IUPAC Standard InChIKey: RDIUVVQMLJOTAO-UHFFFAOYSA-N
- CAS Registry Number: 88090-38-4
- Chemical structure:
View 3d structure (requires JavaScript / HTML 5) - Permanent link for this species. Use this link for bookmarking this species for future reference.

Gas phase ion energetics data

Data compiled by: Sharon G. Lias, John E. Bartmess, Joel F. Liebman, John L. Holmes, Rhoda D. Levin, and W. Gary Mallard
Ionization energy determinations
IE (eV) | Method | Reference | Comment |
---|---|---|---|
8.0 | PE | Gleiter, Krennrich, et al., 1986 | |
8.14 | PE | Gleiter, Krennrich, et al., 1986 | Vertical value |

References

Gleiter, Krennrich, et al., 1986
Gleiter, R.; Krennrich, G.; Bischof, P.; Tsuji, T.; Nishida, S.,
103. PE spectra of dewar benzenes, bridged by a cyclohexadiene or a butadiene unit,
Helv. Chim. Acta, 1986, 69, 962. [all data]