1,4:5,8:9,10-Trimethanoanthracene, 1,4,4a,5,8,8a,9,9a,10,10a-decahydro-(1α,4α,4aα,5α,8α,8aα,9α,9aβ,10α,10aβ)-
- Formula: C17H20
- Molecular weight: 224.3407
- IUPAC Standard InChIKey: KVHGVQIXSZOTQM-PRFZSGCOSA-N
- CAS Registry Number: 83830-72-2
- Chemical structure:
View 3d structure (requires JavaScript / HTML 5) - Stereoisomers:

Gas phase ion energetics data

Data compiled by: Sharon G. Lias, John E. Bartmess, Joel F. Liebman, John L. Holmes, Rhoda D. Levin, and W. Gary Mallard
Ionization energy determinations
IE (eV) | Method | Reference | Comment |
---|---|---|---|
8.58 | PE | Jorgensen, Paddon-Row, et al., 1983 | Vertical value |

References

Jorgensen, Paddon-Row, et al., 1983
Jorgensen, F.S.; Paddon-Row, M.N.; Patney, H.K.,
Photoelectron spectra of some decahydrotrimethanoanthracenes: Observation of large pi orbital interactions through six bonds and an apparent violation of the trans rule,
J. Chem. Soc., Chem. Commun., 1983, 573. [all data]