Isoprene
- Formula: C5H8
- Molecular weight: 68.1170
- IUPAC Standard InChIKey: RRHGJUQNOFWUDK-UHFFFAOYSA-N
- CAS Registry Number: 78-79-5
- Chemical structure:
View 3d structure (requires JavaScript / HTML 5) - Other names: 1,3-Butadiene, 2-methyl-; β-Methylbivinyl; Isopentadiene; 2-Methyl-1,3-butadiene; 2-Methylbutadiene; CH2=C(CH3)CH=CH2; 2-Methylbuta-1,3-diene; 3-Methyl-1,3-butadiene; NSC 9237

Kovats' RI, non-polar column, isothermal

Column type | Active phase | Temperature (C) | I | Reference | Comment |
---|---|---|---|---|---|
Capillary | OV-1 | 27. | 496. | Heberger, 1990 | 25. m/0.25 mm/0.50 μm, He |
Capillary | OV-1 | 30. | 508. | Heberger, 1990 | 25. m/0.25 mm/0.50 μm, He |
Capillary | OV-1 | 75. | 506. | Heberger, 1990 | 25. m/0.25 mm/0.50 μm, He |
Packed | Squalane | 70. | 499. | Safina, Poznyak, et al., 1989 | He, Risorb (0.2-0.3 mm); Column length: 2. m |
Capillary | Squalane | 50. | 497.5 | Papazova, Milina, et al., 1988 | Column length: 50. m; Column diameter: 0.25 mm |
Capillary | SE-30 | 80. | 507. | Bredael, 1982 | Column length: 100. m; Column diameter: 0.5 mm |
Capillary | Squalane | 50. | 497.6 | Bajus, Veselý, et al., 1979 | Column length: 100. m; Column diameter: 0.25 mm |
Capillary | Squalane | 70. | 491.5 | Bajus, Veselý, et al., 1979 | Column length: 100. m; Column diameter: 0.25 mm |
Capillary | Squalane | 27. | 495.70 | Schomburg and Dielmann, 1973 | Column length: 100. m; Column diameter: 0.25 mm |
Packed | Squalane | 27. | 496. | Hively and Hinton, 1968 | He, Chromosorb P; Column length: 15. m; Column diameter: 0.25 mm |
Packed | Squalane | 49. | 497. | Hively and Hinton, 1968 | He, Chromosorb P; Column length: 15. m; Column diameter: 0.25 mm |
Packed | Squalane | 67. | 501. | Hively and Hinton, 1968 | He, Chromosorb P; Column length: 15. m; Column diameter: 0.25 mm |
Packed | Squalane | 86. | 501. | Hively and Hinton, 1968 | He, Chromosorb P; Column length: 15. m; Column diameter: 0.25 mm |
Packed | SE-30 | 70. | 507. | Widmer, 1967 | Diatoport S; Column length: 7.9 m |
Packed | Squalane | 26. | 499. | Zulaïca and Guiochon, 1966 | Column length: 10. m |
Packed | Apiezon L | 130. | 514. | Wehrli and Kováts, 1959 | Celite; Column length: 2.25 m |
Packed | Apiezon L | 70. | 511. | Wehrli and Kováts, 1959 | Celite; Column length: 2.25 m |

Kovats' RI, non-polar column, custom temperature program

Column type | Active phase | I | Reference | Comment |
---|---|---|---|---|
Capillary | Petrocol DH-100 | 506. | Haagen-Smit Laboratory, 1997 | He; Column length: 100. m; Column diameter: 0.2 mm; Program: 5C(10min) => 5C/min => 50C(48min) => 1.5C/min => 195C(91min) |
Capillary | DB-1 | 504. | Hoekman, 1993 | 60. m/0.32 mm/1.0 μm, He; Program: -40 C for 12 min; -40 - 125 C at 3 deg.min; 125-185 C at 6 deg/min; 185 - 220 C at 20 deg/min; hold 220 C for 2 min |

Kovats' RI, polar column, isothermal

Column type | Active phase | Temperature (C) | I | Reference | Comment |
---|---|---|---|---|---|
Packed | Carbowax 20M | 130. | 624. | Widmer, 1967 | Diatoport P; Column length: 7.9 m |
Packed | Carbowax 20M | 70. | 602. | Widmer, 1967 | Diatoport P; Column length: 7.9 m |

Van Den Dool and Kratz RI, non-polar column, temperature ramp

Column type | Active phase | I | Reference | Comment |
---|---|---|---|---|
Capillary | DB-1 | 502.2 | Helmig, Klinger, et al., 1999 | 60. m/0.32 mm/1. μm, -50. C @ 2. min, 6. K/min; Tend: 175. C |
Capillary | DB-1 | 504. | Helmig, Pollock, et al., 1996 | 30. m/0.25 mm/1. μm, 6. K/min; Tstart: -50. C; Tend: 180. C |
Capillary | DB-5 | 520. | Helmig, Pollock, et al., 1996 | 60. m/0.33 mm/0.25 μm, 6. K/min; Tstart: -50. C; Tend: 180. C |

Normal alkane RI, non-polar column, isothermal

Column type | Active phase | Temperature (C) | I | Reference | Comment |
---|---|---|---|---|---|
Capillary | Squalane | 70. | 497. | Schomburg, 1966 |

Normal alkane RI, non-polar column, temperature ramp

Column type | Active phase | I | Reference | Comment |
---|---|---|---|---|
Capillary | Polydimethyl siloxane: CP-Sil 5 CB | 504. | Bramston-Cook, 2013 | 60. m/0.25 mm/1.0 μm, Helium, 45. C @ 1.45 min, 3.6 K/min, 210. C @ 2.72 min |
Capillary | Petrocol DH | 505. | Supelco, 2012 | 100. m/0.25 mm/0.50 μm, Helium, 20. C @ 15. min, 15. K/min, 220. C @ 30. min |
Capillary | Methyl Silicone | 502.95 | Baraldi, Rapparini, et al., 1999 | 60. m/0.25 mm/0.25 μm, 40. C @ 10. min, 5. K/min; Tend: 220. C |
Capillary | OV-101 | 500. | Orav, Kailas, et al., 1999 | 50. m/0.20 mm/0.50 μm, Helium, 30. C @ 6. min, 1. K/min; Tend: 100. C |
Capillary | OV-101 | 502. | Chupalov and Zenkevich, 1996 | N2, 3. K/min; Column length: 52. m; Column diameter: 0.26 mm; Tstart: 50. C; Tend: 220. C |
Capillary | DB-1 | 503. | Ciccioli, Cecinato, et al., 1992 | 60. m/0.32 mm/1.2 μm, He, 30. C @ 10. min, 3. K/min; Tend: 240. C |

Normal alkane RI, non-polar column, custom temperature program

Column type | Active phase | I | Reference | Comment |
---|---|---|---|---|
Capillary | Methyl Silicone | 504. | Blunden, Aneja, et al., 2005 | 60. m/0.32 mm/1.0 μm, Helium; Program: -50 0C (2 min) 8 0C/min -> 200 0C (7.75 min) 25 0C -> 225 0C (8 min) |
Capillary | PONA | 506. | Perkin Elmer Instruments, 2002 | Column length: 100. m; Phase thickness: 0.50 μm; Program: not specified |
Capillary | OV-101 | 502. | Zenkevich, 1998 | He; Column length: 25. m; Column diameter: 0.20 mm; Program: not specified |
Capillary | OV-101 | 503. | Zenkevich, 1998 | He; Column length: 25. m; Column diameter: 0.20 mm; Program: not specified |
Capillary | SPB-1 | 504. | Flanagan, Streete, et al., 1997 | 60. m/0.53 mm/5. μm, He; Program: 40C(6min) => 5C/min => 80C => 10C/min => 200C |
Capillary | DB-1 | 503. | Ciccioli, Cecinato, et al., 1994 | 60. m/0.32 mm/0.25 μm; Program: not specified |
Capillary | DB-1 | 503. | Ciccioli, Brancaleoni, et al., 1993 | 60. m/0.32 mm/0.25 μm; Program: 3 min at 5 C; 5 - 50 C at 3 deg/min; 50 - 220 C at 5 deg/min |
Capillary | SPB-1 | 504. | Strete, Ruprah, et al., 1992 | 60. m/0.53 mm/5.0 μm, Helium; Program: 40 0C (6 min) 5 0C/min -> 80 0C 10 0C/min -> 200 0C |

Normal alkane RI, polar column, custom temperature program

Column type | Active phase | I | Reference | Comment |
---|---|---|---|---|
Capillary | Carbowax 400, Carbowax 20M, Carbowax 1540, Carbowax 4000, Superox 06, PEG 20M, etc. | 633. | Waggott and Davies, 1984 | Hydrogen; Column length: 50. m; Column diameter: 0.32 mm; Program: not specified |

Gas phase thermochemistry data

Data compiled as indicated in comments:
ALS - Hussein Y. Afeefy, Joel F. Liebman, and Stephen E. Stein
GT - Glushko Thermocenter, Russian Academy of Sciences, Moscow
Quantity | Value | Units | Method | Reference | Comment |
---|---|---|---|---|---|
ΔfH°gas | 75.7 ± 1.0 | kJ/mol | Cm | Fraser and Prosen, 1955 | ALS |
Quantity | Value | Units | Method | Reference | Comment |
ΔcH°gas | -3186.6 ± 0.96 | kJ/mol | Cm | Fraser and Prosen, 1955 | Corresponding ΔfHºgas = 75.73 kJ/mol (simple calculation by NIST; no Washburn corrections); ALS |
Quantity | Value | Units | Method | Reference | Comment |
S°gas | 314.76 | J/mol*K | N/A | Messerly J.F., 1970 | GT |
Constant pressure heat capacity of gas
Cp,gas (J/mol*K) | Temperature (K) | Reference | Comment |
---|---|---|---|
36.28 | 50. | Thermodynamics Research Center, 1997 | Values of S(T) and Cp(T) from other statistical mechanics calculation [ Compton D.A.C., 1977] are in close agreement with recommended ones.; GT |
47.75 | 100. | ||
60.95 | 150. | ||
74.81 | 200. | ||
95.64 | 273.15 | ||
102.69 | 298.15 | ||
103.21 | 300. | ||
129.59 | 400. | ||
152.16 | 500. | ||
171.03 | 600. | ||
186.95 | 700. | ||
200.6 | 800. | ||
212.3 | 900. | ||
222.5 | 1000. | ||
231.3 | 1100. | ||
238.9 | 1200. | ||
245.5 | 1300. | ||
251.2 | 1400. | ||
256.2 | 1500. |

Condensed phase thermochemistry data

Data compiled as indicated in comments:
ALS - Hussein Y. Afeefy, Joel F. Liebman, and Stephen E. Stein
DH - Eugene S. Domalski and Elizabeth D. Hearing
Quantity | Value | Units | Method | Reference | Comment |
---|---|---|---|---|---|
ΔcH°liquid | -3158.2 ± 1.6 | kJ/mol | Ccb | Jessup, 1938 | Reanalyzed by Cox and Pilcher, 1970, Original value = -3156.9 ± 1.6 kJ/mol; Corresponding ΔfHºliquid = 47.3 kJ/mol (simple calculation by NIST; no Washburn corrections); ALS |
Quantity | Value | Units | Method | Reference | Comment |
S°liquid | 228.28 | J/mol*K | N/A | Messerly, Todd, et al., 1970 | DH |
S°liquid | 229.2 | J/mol*K | N/A | Warfield and Petree, 1965 | DH |
S°liquid | 229.3 | J/mol*K | N/A | Bekkedahl and Wood, 1937 | DH |
Constant pressure heat capacity of liquid
Cp,liquid (J/mol*K) | Temperature (K) | Reference | Comment |
---|---|---|---|
151.08 | 298.15 | Messerly, Todd, et al., 1970 | T = 12 to 320 K.; DH |
152.5 | 298.15 | Warfield and Petree, 1965 | T = 20 to 300 K. A reexamination of 37BEK/WOO.; DH |
152.6 | 298.2 | Bekkedahl and Wood, 1937 | T = 20 to 300 K.; DH |

Phase change data

Data compiled as indicated in comments:
BS - Robert L. Brown and Stephen E. Stein
TRC - Thermodynamics Research Center, NIST Boulder Laboratories, Chris Muzny director
AC - William E. Acree, Jr., James S. Chickos
ALS - Hussein Y. Afeefy, Joel F. Liebman, and Stephen E. Stein
DH - Eugene S. Domalski and Elizabeth D. Hearing
Quantity | Value | Units | Method | Reference | Comment |
---|---|---|---|---|---|
Tboil | 307. ± 2. | K | AVG | N/A | Average of 17 values; Individual data points |
Quantity | Value | Units | Method | Reference | Comment |
Tfus | 131. ± 20. | K | AVG | N/A | Average of 7 values; Individual data points |
Quantity | Value | Units | Method | Reference | Comment |
Ttriple | 127.27 | K | N/A | Messerly, Todd, et al., 1970, 2 | Uncertainty assigned by TRC = 0.05 K; TRC |
Ttriple | 126.4 | K | N/A | Bekkedahl and Wood, 1937, 2 | Uncertainty assigned by TRC = 0.2 K; TRC |
Quantity | Value | Units | Method | Reference | Comment |
ΔvapH° | 26.4 | kJ/mol | N/A | Reid, 1972 | AC |
ΔvapH° | 26.8 ± 0.3 | kJ/mol | V | Rogers, 1971 | ALS |
Enthalpy of vaporization
ΔvapH (kJ/mol) | Temperature (K) | Method | Reference | Comment |
---|---|---|---|---|
29.4 | 239. | A | Stephenson and Malanowski, 1987 | Based on data from 221. to 254. K.; AC |
28.3 | 269. | A | Stephenson and Malanowski, 1987 | Based on data from 254. to 316. K.; AC |
31.5 | 225. | IP | Osborn and Douslin, 1969 | Based on data from 216. to 235. K.; AC |
27.3 | 299. | MM | Forziati, Camin, et al., 1950 | Based on data from 290. to 308. K.; AC |
27.4 | 288. | N/A | Kuchinskaya, 1938 | Based on data from 258. to 318. K.; AC |
25.8 | 307.2 | V | Bekkedahl, Wood, et al., 1936 | ALS |
Antoine Equation Parameters
log10(P) = A − (B / (T + C))
P = vapor pressure (bar)
T = temperature (K)
View plot Requires a JavaScript / HTML 5 canvas capable browser.
Temperature (K) | A | B | C | Reference | Comment |
---|---|---|---|---|---|
215.6 to 234.92 | 4.08822 | 1108.151 | -35.731 | Osborn and Douslin, 1969 | Coefficents calculated by NIST from author's data. |
289.9 to 307. | 3.21586 | 706.92 | -87.046 | Gubkov, Fermor, et al., 1964 | Coefficents calculated by NIST from author's data. |
Enthalpy of fusion
ΔfusH (kJ/mol) | Temperature (K) | Reference | Comment |
---|---|---|---|
4.9246 | 127.27 | Messerly, Todd, et al., 1970 | DH |
4.830 | 126.4 | Warfield and Petree, 1965 | DH |
4.830 | 126.4 | Bekkedahl and Wood, 1937 | DH |
4.92 | 127.3 | Domalski and Hearing, 1996 | AC |
Entropy of fusion
ΔfusS (J/mol*K) | Temperature (K) | Reference | Comment |
---|---|---|---|
38.694 | 127.27 | Messerly, Todd, et al., 1970 | DH |
38.21 | 126.4 | Warfield and Petree, 1965 | DH |
38.21 | 126.4 | Bekkedahl and Wood, 1937 | DH |

Henry's Law data

Data compiled by: Rolf Sander
Henry's Law constant (water solution)
kH(T) = k°H exp(d(ln(kH))/d(1/T) ((1/T) - 1/(298.15 K)))
k°H = Henry's law constant for solubility in water at 298.15 K (mol/(kg*bar))
d(ln(kH))/d(1/T) = Temperature dependence constant (K)
k°H (mol/(kg*bar)) | d(ln(kH))/d(1/T) (K) | Method | Reference | Comment |
---|---|---|---|---|
0.028 | M | N/A | missing citation also measured solubilities in salt solutions. | |
0.013 | Q | N/A | missing citation give several references for the Henry's law constants but don't assign them to specific species. | |
0.013 | L | N/A | ||
0.013 | V | N/A |

Ion clustering data

Data compiled by: Robert C. Dunbar
Clustering reactions
By formula: Ag+ + C5H8 = (Ag+ • C5H8)
Quantity | Value | Units | Method | Reference | Comment |
---|---|---|---|---|---|
ΔrH° | 164. ± 19. | kJ/mol | RAK | Ho, Yang, et al., 1997 |

Reaction thermochemistry data

Data compiled as indicated in comments:
B - John E. Bartmess
ALS - Hussein Y. Afeefy, Joel F. Liebman, and Stephen E. Stein
RCD - Robert C. Dunbar
Individual Reactions
C5H7- + =
Quantity | Value | Units | Method | Reference | Comment |
---|---|---|---|---|---|
ΔrH° | 1613. ± 21. | kJ/mol | G+TS | Bartmess and McIver Jr., 1979 | gas phase; Between H2O, MeOH. Acid: isoprene; B |
Quantity | Value | Units | Method | Reference | Comment |
ΔrG° | 1586. ± 21. | kJ/mol | IMRB | Bartmess and McIver Jr., 1979 | gas phase; Between H2O, MeOH. Acid: isoprene; B |
By formula: C11H8N4 = C6N4 + C5H8
Quantity | Value | Units | Method | Reference | Comment |
---|---|---|---|---|---|
ΔrH° | 157. ± 3. | kJ/mol | Cm | Rogers, 1971 | solid phase; Heat of formation derived by 77PED/RYL; ALS |
By formula: C6N4 + C5H8 = C11H8N4
Quantity | Value | Units | Method | Reference | Comment |
---|---|---|---|---|---|
ΔrH° | -157. ± 3. | kJ/mol | Cm | Rogers, 1971 | liquid phase; solvent: Dichloromethane; ALS |
By formula: Ag+ + C5H8 = (Ag+ • C5H8)
Quantity | Value | Units | Method | Reference | Comment |
---|---|---|---|---|---|
ΔrH° | 164. ± 19. | kJ/mol | RAK | Ho, Yang, et al., 1997 | RCD |

Gas phase ion energetics data

Data evaluated as indicated in comments:
HL - Edward P. Hunter and Sharon G. Lias
L - Sharon G. Lias
Data compiled as indicated in comments:
B - John E. Bartmess
LL - Sharon G. Lias and Joel F. Liebman
LLK - Sharon G. Lias, Rhoda D. Levin, and Sherif A. Kafafi
RDSH - Henry M. Rosenstock, Keith Draxl, Bruce W. Steiner, and John T. Herron
LBLHLM - Sharon G. Lias, John E. Bartmess, Joel F. Liebman, John L. Holmes, Rhoda D. Levin, and W. Gary Mallard
Quantity | Value | Units | Method | Reference | Comment |
---|---|---|---|---|---|
IE (evaluated) | 8.86 ± 0.02 | eV | N/A | N/A | L |
Quantity | Value | Units | Method | Reference | Comment |
Proton affinity (review) | 197.5 | kcal/mol | N/A | Hunter and Lias, 1998 | HL |
Quantity | Value | Units | Method | Reference | Comment |
Gas basicity | 190.6 | kcal/mol | N/A | Hunter and Lias, 1998 | HL |
Ionization energy determinations
IE (eV) | Method | Reference | Comment |
---|---|---|---|
8.85 ± 0.02 | PE | Bieri, Burger, et al., 1977 | LLK |
8.85 | EI | Lossing and Traeger, 1975 | LLK |
8.90 ± 0.10 | EI | Puttemans and Delvaux, 1973 | LLK |
8.89 | PE | Beez, Bieri, et al., 1973 | LLK |
8.845 ± 0.005 | PI | Watanabe, Nakayama, et al., 1962 | RDSH |
8.84 ± 0.01 | S | Price and Walsh, 1940 | RDSH |
8.85 | PE | Werstiuk, Clark, et al., 1990 | Vertical value; LL |
8.85 | PE | Masclet, Mouvier, et al., 1981 | Vertical value; LLK |
8.87 | PE | Worley, Webb, et al., 1979 | Vertical value; LLK |
9.04 | PE | Sustmann and Schubert, 1972 | Vertical value; LLK |
Appearance energy determinations
Ion | AE (eV) | Other Products | Method | Reference | Comment |
---|---|---|---|---|---|
C3H3+ | 14.55 ± 0.15 | C2H4+H | EI | Puttemans and Delvaux, 1973 | LLK |
C3H4+ | 12.39 ± 0.12 | C2H4 | EI | Puttemans and Delvaux, 1973 | LLK |
C3H5+ | 14.04 ± 0.10 | C2H2+H | EI | Puttemans and Delvaux, 1973 | LLK |
C3H6+ | 12.76 ± 0.10 | C2H2 | EI | Puttemans and Delvaux, 1973 | LLK |
C4H5+ | 11.44 | CH3 | EI | Lossing and Holmes, 1984 | LBLHLM |
C4H5+ | 11.93 ± 0.10 | CH3 | EI | Puttemans and Delvaux, 1973 | LLK |
C5H5+ | 13.9 | H2+H | EI | Harrison, Haynes, et al., 1965 | RDSH |
C5H7+ | 10.54 | H | EI | Lossing and Traeger, 1975 | LLK |
C5H7+ | 10.54 | H | EI | Holmes, 1974 | LLK |
C5H7+ | 10.93 ± 0.10 | H | EI | Puttemans and Delvaux, 1973 | LLK |
De-protonation reactions
C5H7- + =
Quantity | Value | Units | Method | Reference | Comment |
---|---|---|---|---|---|
ΔrH° | 385.6 ± 5.1 | kcal/mol | G+TS | Bartmess and McIver Jr., 1979 | gas phase; Between H2O, MeOH. Acid: isoprene; B |
Quantity | Value | Units | Method | Reference | Comment |
ΔrG° | 379.0 ± 5.0 | kcal/mol | IMRB | Bartmess and McIver Jr., 1979 | gas phase; Between H2O, MeOH. Acid: isoprene; B |

References

Heberger, 1990
Heberger, K.,
Identification of C5H8 Isomers Through Reactions of Singlet Methylene, CH2(ã1A1), with Unsaturated Hydrocarbons Using Capillary Gas Chromatography - Mass Spectrometry,
Analyst, 1990, 115, 6, 725-729, https://doi.org/10.1039/an9901500725
. [all data]
Safina, Poznyak, et al., 1989
Safina, L.R.; Poznyak, T.I.; Lisitsyn, D.M.; Kiseleva, E.V.; Kovalev, G.I.,
Selective gas-chromatographic determination of trace unsaturated and aromatic-hydrocarbons in complex-mixtures,
J. Appl. Chem. USSR (Engl. Transl.), 1989, 44, 5, 749-754. [all data]
Papazova, Milina, et al., 1988
Papazova, D.; Milina, R.; Dimov, N.,
Comparative evaluation of retention of hydrocarbons present in the C5-petroleum fraction of methylsilicone and squalane phases,
Chromatographia, 1988, 25, 3, 177-180, https://doi.org/10.1007/BF02316441
. [all data]
Bredael, 1982
Bredael, P.,
Retention indices of hydrocarbons on SE-30,
J. Hi. Res. Chromatogr. Chromatogr. Comm., 1982, 5, 6, 325-328, https://doi.org/10.1002/jhrc.1240050610
. [all data]
Bajus, Veselý, et al., 1979
Bajus, M.; Veselý, V.; Leclercq, P.A.; Rijks, J.A.,
Steam cracking of hydrocarbons. 2. Pyrolysis of methylcyclohexane,
Ind. Eng. Chem. Prod. Res. Dev., 1979, 18, 2, 135-142, https://doi.org/10.1021/i360070a012
. [all data]
Schomburg and Dielmann, 1973
Schomburg, G.; Dielmann, G.,
Identification by means of retention parameters,
J. Chromatogr. Sci., 1973, 11, 3, 151-159, https://doi.org/10.1093/chromsci/11.3.151
. [all data]
Hively and Hinton, 1968
Hively, R.A.; Hinton, R.E.,
Variation of the retention index with temperature on squalane substrates,
J. Gas Chromatogr., 1968, 6, 4, 203-217, https://doi.org/10.1093/chromsci/6.4.203
. [all data]
Widmer, 1967
Widmer, H.,
Gas chromatographic identification of hydrocarbons using retention indices,
J. Gas Chromatogr., 1967, 5, 10, 506-510, https://doi.org/10.1093/chromsci/5.10.506
. [all data]
Zulaïca and Guiochon, 1966
Zulaïca, J.; Guiochon, G.,
Analyse des hauts polymères par chromatographie en phase gazeuse de leurs produits de pyrolyse. II. Application à quelques hydrocarbures macromoléculaires purs,
Bull. Soc. Chim. Fr., 1966, 4, 1351-1363. [all data]
Wehrli and Kováts, 1959
Wehrli, A.; Kováts, E.,
Gas-chromatographische Charakterisierung ogranischer Verbindungen. Teil 3: Berechnung der Retentionsindices aliphatischer, alicyclischer und aromatischer Verbindungen,
Helv. Chim. Acta, 1959, 7, 7, 2709-2736, https://doi.org/10.1002/hlca.19590420745
. [all data]
Haagen-Smit Laboratory, 1997
Haagen-Smit Laboratory,
Procedure for the detailed hydrocarbon analysis of gasolines by single column high efficiency (capillary) column gas chromatography, SOP NO. MLD 118, Revision No. 1.1, California Environmental Protection Agency, Air Resources Board, El Monte, California, 1997, 22. [all data]
Hoekman, 1993
Hoekman, S.K.,
Improved gas chromatography procedure for speciated hydrocarbon measurements of vehicle emissions,
J. Chromatogr., 1993, 639, 2, 239-253, https://doi.org/10.1016/0021-9673(93)80260-F
. [all data]
Helmig, Klinger, et al., 1999
Helmig, D.; Klinger, L.F.; Guenther, A.; Vierling, L.; Geron, C.; Zimmerman, P.,
Biogenic volatile organic compound emissions (BVOCs). I. Identifications from three continental sites in the U.S.,
Chemosphere, 1999, 38, 9, 2163-2187, https://doi.org/10.1016/S0045-6535(98)00425-1
. [all data]
Helmig, Pollock, et al., 1996
Helmig, D.; Pollock, W.; Greenberg, J.; Zimmerman, P.,
Gas chromatography mass spectrometry analysis of volatile organic trace gases at Mauna Loa Observatory, Hawaii,
J. Geophys. Res., 1996, 101, D9, 14697-14710, https://doi.org/10.1029/96JD00212
. [all data]
Schomburg, 1966
Schomburg, G.,
Gaschromatographische Retentionsdaten und Struktur Chemischer Verbindungen. II. Methylverzweigungen und Doppelbindungen in Offenkettigen Kohlenwasserstoffen,
J. Chromatogr., 1966, 23, 1-17, https://doi.org/10.1016/S0021-9673(01)98652-2
. [all data]
Bramston-Cook, 2013
Bramston-Cook, R.,
Kovats indices for C2-C13 hydrocarbons and selected oxygenated/halocarbons with 100 % dimethylpolysiloxane columns, 2013, retrieved from http://lotusinstruments.com/monographs/List .... [all data]
Supelco, 2012
Supelco, CatalogNo. 24160-U,
Petrocol DH Columns. Catalog No. 24160-U, 2012, retrieved from http://www.sigmaaldrich.com/etc/medialib/docs/Supelco/Datasheet/1/w97949.Par.0001.File.tmp/w97949.pdf. [all data]
Baraldi, Rapparini, et al., 1999
Baraldi, R.; Rapparini, F.; Rossi, F.; Latella, A.; Ciccioli, P.,
Volatile organic compound emissions from flowers of the most occurring and economically important species of fruit trees,
Phys. Chem. Earth, 1999, 24, 6, 729-732, https://doi.org/10.1016/S1464-1909(99)00073-8
. [all data]
Orav, Kailas, et al., 1999
Orav, A.; Kailas, T.; Muurisepp, M.; Kann, J.,
Composition of the oil from waste tires. 1. Fraction boiling at yp to 160 0C,
Proc. Estonian Acad. Sci. Chem., 1999, 48, 1, 30-39. [all data]
Chupalov and Zenkevich, 1996
Chupalov, A.A.; Zenkevich, I.G.,
Chromatographic Characterization of Structural Transformations of Organic Compounds in Diels-Alder Reaction. Aliphatic Dienes and Dienophyls,
Zh. Org. Khim., 1996, 32, 6, 675-684. [all data]
Ciccioli, Cecinato, et al., 1992
Ciccioli, P.; Cecinato, A.; Brancaleoni, E.; Frattoni, M.; Liberti, A.,
Use of carbon adsorption traps combined with high resolution gas chromatography - mass spectrometry for the analysis of polar and non-polar C4-C14 hydrocarbons involved in photochemical smog formation,
J. Hi. Res. Chromatogr., 1992, 15, 2, 75-84, https://doi.org/10.1002/jhrc.1240150205
. [all data]
Blunden, Aneja, et al., 2005
Blunden, J.; Aneja, V.P.; Lonneman, W.A.,
Characterization of non-methane volatile organic compounds at swine facilities in eastern North Carolina,
Atm. Environ., 2005, 39, 36, 6707-6718, https://doi.org/10.1016/j.atmosenv.2005.03.053
. [all data]
Perkin Elmer Instruments, 2002
Perkin Elmer Instruments,
Detailed hydrocarbon analysis (DHAX) Model 4015, 2002, retrieved from http://www.perkinelmer.com/instruments. [all data]
Zenkevich, 1998
Zenkevich, I.G.,
Application of Methods of Molecular Dynamics in Chromato-Spectral Identification of ISomeric Products of Organic reactions (in Russian),
Zh. Org. Khim., 1998, 34, 10, 1463-1470. [all data]
Flanagan, Streete, et al., 1997
Flanagan, R.J.; Streete, P.J.; Ramsey, J.D.,
Volatile Substance Abuse, UNODC Technical Series, No 5, United Nations, Office on Drugs and Crime, Vienna International Centre, PO Box 500, A-1400 Vienna, Austria, 1997, 56, retrieved from http://www.odccp.org/pdf/technicalseries1997-01-011.pdf. [all data]
Ciccioli, Cecinato, et al., 1994
Ciccioli, P.; Cecinato, A.; Brancaleoni, E.; Brachetti, A.; Frattoni, M.; Sparapani, R.,
Composition and Distribution of Polar and Non-Polar VOCs in Urban, Rural, Forest and Remote Areas,
Eur Commission EUR, 1994, 549-568. [all data]
Ciccioli, Brancaleoni, et al., 1993
Ciccioli, P.; Brancaleoni, E.; Cecinato, A.; Sparapani, R.; Frattoni, M.,
Identification and determination of biogenic and anthropogenic volatile organic compounds in forest areas of Northern and Southern Europe and a remote site of the Himalaya region by high-resolution gas chromatography-mass spectrometry,
J. Chromatogr., 1993, 643, 1-2, 55-69, https://doi.org/10.1016/0021-9673(93)80541-F
. [all data]
Strete, Ruprah, et al., 1992
Strete, P.J.; Ruprah, M.; Ramsey, J.D.; Flanagan, R.J.,
Detection and identification of volatile substances by headspace capillary gas chromatography to aid the diagnosis of acute poisoning,
Analyst, 1992, 117, 7, 1111-1127, https://doi.org/10.1039/an9921701111
. [all data]
Waggott and Davies, 1984
Waggott, A.; Davies, I.W.,
Identification of organic pollutants using linear temperature programmed retention indices (LTPRIs) - Part II, 1984, retrieved from http://dwi.defra.gov.uk/research/completed-research/reports/dwi0383.pdf. [all data]